CI Summary

sha: e69de29bb2d1d6434b8b29ae775ad8c2e48c5391

branch: trunk

repo: https://github.com/apache/cassandra

Date: Sat May 11 23:16:19 UTC 2024

[Totals]

Passed 162591
Failed 10
Skipped 3364
Total    165965
Files 16239
Suites 16237



[Test Failures]

dtest-latest.configuration_test.TestConfiguration test_change_durable_writes
dtest-latest.configuration_test.TestConfiguration test_change_durable_writes
dtest-upgrade.upgrade_tests.upgrade_through_versions_test.TestProtoV5Upgrade_AllVersions_EndsAt_Trunk_HEAD test_rolling_upgrade
db.DiskBoundaryManagerTest updateTokensTest-system_keyspace_directory_jdk11_x86_64
db.commitlog.CommitlogShutdownTest testShutdownWithPendingTasks-oa_jdk17_x86_64
distributed.test.NativeTransportEncryptionOptionsTest testEndpointVerificationEnabledIpNotInSAN-_jdk17_x86_64
distributed.test.NativeTransportEncryptionOptionsTest testOptionalMtlsModeDoNotAllowNonSSLConnections-_jdk17_x86_64
distributed.test.TransientRangeMovement2Test testMoveForward-_jdk17_x86_64
simulator.test.HarrySimulatorTest test-cassandra.testtag_IS_UNDEFINED
tcm.DiscoverySimulationTest discoveryTest-oa_jdk17_x86_64


[Test Failure Details]

dtest-latest_jdk11_python3.8_cythonno_x86_64_31_64
Class Method Output Duration
dtest-latest.configuration_test.TestConfiguration test_change_durable_writes
AssertionError: Commitlog was written with durable writes disabled
assert 90112 == 86016
  +90112
  -86016-self = 

    @pytest.mark.timeout(60*30)
    def test_change_durable_writes(self):
        """
        @jira_ticket CASSANDRA-9560
    
        Test that changes to the DURABLE_WRITES option on keyspaces is
        respected in subsequent writes.
    
        This test starts by writing a dataset to a cluster and asserting that
        the commitlogs have been written to. The subsequent test depends on
        the assumption that this dataset triggers an fsync.
    
        After checking this assumption, the test destroys the cluster and
        creates a fresh one. Then it tests that DURABLE_WRITES is respected by:
    
        - creating a keyspace with DURABLE_WRITES set to false,
        - using ALTER KEYSPACE to set its DURABLE_WRITES option to true,
        - writing a dataset to this keyspace that is known to trigger a commitlog fsync,
        - asserting that the commitlog has grown in size since the data was written.
        """
        cluster = self.cluster
        cluster.set_batch_commitlog(enabled=True, use_batch_window = cluster.version() < '5.0')
        cluster.set_configuration_options(values={'commitlog_segment_size_in_mb': 1})
    
        cluster.populate(1).start()
        durable_node = cluster.nodelist()[0]
    
        durable_init_size = commitlog_size(durable_node)
        durable_session = self.patient_exclusive_cql_connection(durable_node)
    
        # test assumption that write_to_trigger_fsync actually triggers a commitlog fsync
        durable_session.execute("CREATE KEYSPACE ks WITH REPLICATION = {'class': 'SimpleStrategy', 'replication_factor': 1} "
                                "AND DURABLE_WRITES = true")
        durable_session.execute('CREATE TABLE ks.tab (key int PRIMARY KEY, a int, b int, c int)')
        logger.debug('commitlog size diff = ' + str(commitlog_size(durable_node) - durable_init_size))
        write_to_trigger_fsync(durable_session, 'ks', 'tab')
        logger.debug('commitlog size diff = ' + str(commitlog_size(durable_node) - durable_init_size))
    
        assert commitlog_size(durable_node) > durable_init_size, \
            "This test will not work in this environment; write_to_trigger_fsync does not trigger fsync."
    
        durable_session.shutdown()
        cluster.stop()
        cluster.clear()
    
        cluster.set_batch_commitlog(enabled=True, use_batch_window = cluster.version() < '5.0')
        cluster.set_configuration_options(values={'commitlog_segment_size_in_mb': 1})
        cluster.start()
        node = cluster.nodelist()[0]
        session = self.patient_exclusive_cql_connection(node)
    
        # set up a keyspace without durable writes, then alter it to use them
        session.execute("CREATE KEYSPACE ks WITH REPLICATION = {'class': 'SimpleStrategy', 'replication_factor': 1} "
                        "AND DURABLE_WRITES = false")
        session.execute('CREATE TABLE ks.tab (key int PRIMARY KEY, a int, b int, c int)')
        init_size = commitlog_size(node)
        write_to_trigger_fsync(session, 'ks', 'tab')
>       assert commitlog_size(node) == init_size, "Commitlog was written with durable writes disabled"
E       AssertionError: Commitlog was written with durable writes disabled
E       assert 90112 == 86016
E         +90112
E         -86016

configuration_test.py:104: AssertionError
85.035
dtest-latest_jdk17_python3.8_cythonno_x86_64_31_64
Class Method Output Duration
dtest-latest.configuration_test.TestConfiguration test_change_durable_writes
AssertionError: Commitlog was written with durable writes disabled
assert 90112 == 86016
  +90112
  -86016-self = 

    @pytest.mark.timeout(60*30)
    def test_change_durable_writes(self):
        """
        @jira_ticket CASSANDRA-9560
    
        Test that changes to the DURABLE_WRITES option on keyspaces is
        respected in subsequent writes.
    
        This test starts by writing a dataset to a cluster and asserting that
        the commitlogs have been written to. The subsequent test depends on
        the assumption that this dataset triggers an fsync.
    
        After checking this assumption, the test destroys the cluster and
        creates a fresh one. Then it tests that DURABLE_WRITES is respected by:
    
        - creating a keyspace with DURABLE_WRITES set to false,
        - using ALTER KEYSPACE to set its DURABLE_WRITES option to true,
        - writing a dataset to this keyspace that is known to trigger a commitlog fsync,
        - asserting that the commitlog has grown in size since the data was written.
        """
        cluster = self.cluster
        cluster.set_batch_commitlog(enabled=True, use_batch_window = cluster.version() < '5.0')
        cluster.set_configuration_options(values={'commitlog_segment_size_in_mb': 1})
    
        cluster.populate(1).start()
        durable_node = cluster.nodelist()[0]
    
        durable_init_size = commitlog_size(durable_node)
        durable_session = self.patient_exclusive_cql_connection(durable_node)
    
        # test assumption that write_to_trigger_fsync actually triggers a commitlog fsync
        durable_session.execute("CREATE KEYSPACE ks WITH REPLICATION = {'class': 'SimpleStrategy', 'replication_factor': 1} "
                                "AND DURABLE_WRITES = true")
        durable_session.execute('CREATE TABLE ks.tab (key int PRIMARY KEY, a int, b int, c int)')
        logger.debug('commitlog size diff = ' + str(commitlog_size(durable_node) - durable_init_size))
        write_to_trigger_fsync(durable_session, 'ks', 'tab')
        logger.debug('commitlog size diff = ' + str(commitlog_size(durable_node) - durable_init_size))
    
        assert commitlog_size(durable_node) > durable_init_size, \
            "This test will not work in this environment; write_to_trigger_fsync does not trigger fsync."
    
        durable_session.shutdown()
        cluster.stop()
        cluster.clear()
    
        cluster.set_batch_commitlog(enabled=True, use_batch_window = cluster.version() < '5.0')
        cluster.set_configuration_options(values={'commitlog_segment_size_in_mb': 1})
        cluster.start()
        node = cluster.nodelist()[0]
        session = self.patient_exclusive_cql_connection(node)
    
        # set up a keyspace without durable writes, then alter it to use them
        session.execute("CREATE KEYSPACE ks WITH REPLICATION = {'class': 'SimpleStrategy', 'replication_factor': 1} "
                        "AND DURABLE_WRITES = false")
        session.execute('CREATE TABLE ks.tab (key int PRIMARY KEY, a int, b int, c int)')
        init_size = commitlog_size(node)
        write_to_trigger_fsync(session, 'ks', 'tab')
>       assert commitlog_size(node) == init_size, "Commitlog was written with durable writes disabled"
E       AssertionError: Commitlog was written with durable writes disabled
E       assert 90112 == 86016
E         +90112
E         -86016

configuration_test.py:104: AssertionError
82.936
dtest-upgrade_jdk11_python3.8_cythonno_x86_64_10_64
Class Method Output Duration
dtest-upgrade.upgrade_tests.upgrade_through_versions_test.TestProtoV5Upgrade_AllVersions_EndsAt_Trunk_HEAD test_rolling_upgrade
RuntimeError: A subprocess has terminated early. Subprocess statuses: data_writer (is_alive: False, exitCode: 1), data_checker (is_alive: True, exitCode: None), attempting to terminate remaining subprocesses now.-self = 

    @pytest.mark.timeout(3000)
    def test_rolling_upgrade(self):
        """
        Test rolling upgrade of the cluster, so we have mixed versions part way through.
        """
>       self.upgrade_scenario(rolling=True)

upgrade_tests/upgrade_through_versions_test.py:395: 
_ _ _ _ _ _ _ _ _ _ _ _ _ _ _ _ _ _ _ _ _ _ _ _ _ _ _ _ _ _ _ _ _ _ _ _ _ _ _ _ 
upgrade_tests/upgrade_through_versions_test.py:471: in upgrade_scenario
    self._check_on_subprocs(self.fixture_dtest_setup.subprocs)
_ _ _ _ _ _ _ _ _ _ _ _ _ _ _ _ _ _ _ _ _ _ _ _ _ _ _ _ _ _ _ _ _ _ _ _ _ _ _ _ 

self = 
subprocs = [, ]

    def _check_on_subprocs(self, subprocs):
        """
        Check on given subprocesses.
    
        If any are not alive, we'll go ahead and terminate any remaining alive subprocesses since this test is going to fail.
        """
        subproc_statuses = [s.is_alive() for s in subprocs]
        if not all(subproc_statuses):
            message = "A subprocess has terminated early. Subprocess statuses: "
            for s in subprocs:
                message += "{name} (is_alive: {aliveness}, exitCode: {exitCode}), ".format(name=s.name, aliveness=s.is_alive(), exitCode=s.exitcode)
            message += "attempting to terminate remaining subprocesses now."
            self._terminate_subprocs()
>           raise RuntimeError(message)
E           RuntimeError: A subprocess has terminated early. Subprocess statuses: data_writer (is_alive: False, exitCode: 1), data_checker (is_alive: True, exitCode: None), attempting to terminate remaining subprocesses now.

upgrade_tests/upgrade_through_versions_test.py:532: RuntimeError
246.140
org.apache.cassandra.db.DiskBoundaryManagerTest-system_keyspace_directory_jdk11_x86_64
Class Method Output Duration
db.DiskBoundaryManagerTest updateTokensTest-system_keyspace_directory_jdk11_x86_64
junit.framework.AssertionFailedError
	at org.apache.cassandra.db.DiskBoundaryManagerTest.updateTokensTest(DiskBoundaryManagerTest.java:129)
	at java.base/jdk.internal.reflect.NativeMethodAccessorImpl.invoke0(Native Method)
	at java.base/jdk.internal.reflect.NativeMethodAccessorImpl.invoke(NativeMethodAccessorImpl.java:62)
	at java.base/jdk.internal.reflect.DelegatingMethodAccessorImpl.invoke(DelegatingMethodAccessorImpl.java:43)
0.433
org.apache.cassandra.db.commitlog.CommitlogShutdownTest-oa_jdk17_x86_64
Class Method Output Duration
db.commitlog.CommitlogShutdownTest testShutdownWithPendingTasks-oa_jdk17_x86_64
junit.framework.AssertionFailedError
	at org.apache.cassandra.db.commitlog.CommitlogShutdownTest.testShutdownWithPendingTasks(CommitlogShutdownTest.java:97)
	at java.base/jdk.internal.reflect.NativeMethodAccessorImpl.invoke0(Native Method)
	at java.base/jdk.internal.reflect.NativeMethodAccessorImpl.invoke(NativeMethodAccessorImpl.java:77)
	at java.base/jdk.internal.reflect.DelegatingMethodAccessorImpl.invoke(DelegatingMethodAccessorImpl.java:43)
	at org.jboss.byteman.contrib.bmunit.BMUnitRunner$10.evaluate(BMUnitRunner.java:393)
	at org.jboss.byteman.contrib.bmunit.BMUnitRunner$6.evaluate(BMUnitRunner.java:263)
	at org.jboss.byteman.contrib.bmunit.BMUnitRunner$1.evaluate(BMUnitRunner.java:97)
3.49
org.apache.cassandra.distributed.test.NativeTransportEncryptionOptionsTest-_jdk17_x86_64
Class Method Output Duration
distributed.test.NativeTransportEncryptionOptionsTest testEndpointVerificationEnabledIpNotInSAN-_jdk17_x86_64
java.lang.OutOfMemoryError: Java heap space-java.lang.RuntimeException: java.lang.OutOfMemoryError: Java heap space
	at org.apache.cassandra.distributed.impl.Instance.lambda$startup$7(Instance.java:640)
	at org.apache.cassandra.concurrent.FutureTask$1.call(FutureTask.java:96)
	at org.apache.cassandra.concurrent.FutureTask.call(FutureTask.java:61)
	at org.apache.cassandra.concurrent.FutureTask.run(FutureTask.java:71)
	at java.base/java.util.concurrent.ThreadPoolExecutor.runWorker(ThreadPoolExecutor.java:1136)
	at java.base/java.util.concurrent.ThreadPoolExecutor$Worker.run(ThreadPoolExecutor.java:635)
	at io.netty.util.concurrent.FastThreadLocalRunnable.run(FastThreadLocalRunnable.java:30)
	at java.base/java.lang.Thread.run(Thread.java:840)
Caused by: java.lang.OutOfMemoryError: Java heap space
7.397
distributed.test.NativeTransportEncryptionOptionsTest testOptionalMtlsModeDoNotAllowNonSSLConnections-_jdk17_x86_64
All host(s) tried for query failed (tried: /127.0.0.1:9042 (com.datastax.driver.core.exceptions.TransportException: [/127.0.0.1:9042] Channel has been closed))-com.datastax.driver.core.exceptions.NoHostAvailableException: All host(s) tried for query failed (tried: /127.0.0.1:9042 (com.datastax.driver.core.exceptions.TransportException: [/127.0.0.1:9042] Channel has been closed))
	at com.datastax.driver.core.ControlConnection.reconnectInternal(ControlConnection.java:270)
	at com.datastax.driver.core.ControlConnection.connect(ControlConnection.java:109)
	at com.datastax.driver.core.Cluster$Manager.negotiateProtocolVersionAndConnect(Cluster.java:1813)
	at com.datastax.driver.core.Cluster$Manager.init(Cluster.java:1726)
	at com.datastax.driver.core.Cluster.init(Cluster.java:214)
	at com.datastax.driver.core.Cluster.connectAsync(Cluster.java:387)
	at com.datastax.driver.core.Cluster.connectAsync(Cluster.java:366)
	at com.datastax.driver.core.Cluster.connect(Cluster.java:311)
	at org.apache.cassandra.distributed.test.NativeTransportEncryptionOptionsTest.testOptionalMtlsModeDoNotAllowNonSSLConnections(NativeTransportEncryptionOptionsTest.java:300)
	at java.base/jdk.internal.reflect.NativeMethodAccessorImpl.invoke0(Native Method)
	at java.base/jdk.internal.reflect.NativeMethodAccessorImpl.invoke(NativeMethodAccessorImpl.java:77)
	at java.base/jdk.internal.reflect.DelegatingMethodAccessorImpl.invoke(DelegatingMethodAccessorImpl.java:43)
12.126
org.apache.cassandra.distributed.test.TransientRangeMovement2Test-_jdk17_x86_64
Class Method Output Duration
distributed.test.TransientRangeMovement2Test testMoveForward-_jdk17_x86_64
SHOULD NOT BE ON NODE: 11 -- [(16,30)]: [00, 02, 04, 06, 08, 10, 11, 12, 13, 14, 15, 16, 17, 18, 19, 20, 21, 22, 23, 24, 25, 26, 27, 28, 29, 30, 42, 44, 46, 48]-junit.framework.AssertionFailedError: SHOULD NOT BE ON NODE: 11 -- [(16,30)]: [00, 02, 04, 06, 08, 10, 11, 12, 13, 14, 15, 16, 17, 18, 19, 20, 21, 22, 23, 24, 25, 26, 27, 28, 29, 30, 42, 44, 46, 48]
	at org.apache.cassandra.distributed.test.TransientRangeMovementTest.assertAllContained(TransientRangeMovementTest.java:231)
	at org.apache.cassandra.distributed.test.TransientRangeMovement2Test.testMoveForward(TransientRangeMovement2Test.java:143)
	at java.base/jdk.internal.reflect.NativeMethodAccessorImpl.invoke0(Native Method)
	at java.base/jdk.internal.reflect.NativeMethodAccessorImpl.invoke(NativeMethodAccessorImpl.java:77)
	at java.base/jdk.internal.reflect.DelegatingMethodAccessorImpl.invoke(DelegatingMethodAccessorImpl.java:43)
37.077
org.apache.cassandra.simulator.test.HarrySimulatorTest-cassandra.testtag_IS_UNDEFINED
Class Method Output Duration
simulator.test.HarrySimulatorTest test-cassandra.testtag_IS_UNDEFINED
Forked Java VM exited abnormally. Please note the time in the report does not reflect the time until the VM exit.-junit.framework.AssertionFailedError: Forked Java VM exited abnormally. Please note the time in the report does not reflect the time until the VM exit.
	at jdk.internal.reflect.GeneratedMethodAccessor4.invoke(Unknown Source)
	at java.base/jdk.internal.reflect.DelegatingMethodAccessorImpl.invoke(DelegatingMethodAccessorImpl.java:43)
	at java.base/java.util.Vector.forEach(Vector.java:1394)
	at jdk.internal.reflect.GeneratedMethodAccessor4.invoke(Unknown Source)
	at java.base/jdk.internal.reflect.DelegatingMethodAccessorImpl.invoke(DelegatingMethodAccessorImpl.java:43)
	at jdk.internal.reflect.GeneratedMethodAccessor4.invoke(Unknown Source)
	at java.base/jdk.internal.reflect.DelegatingMethodAccessorImpl.invoke(DelegatingMethodAccessorImpl.java:43)
	at java.base/java.util.Vector.forEach(Vector.java:1394)
	at jdk.internal.reflect.GeneratedMethodAccessor4.invoke(Unknown Source)
	at java.base/jdk.internal.reflect.DelegatingMethodAccessorImpl.invoke(DelegatingMethodAccessorImpl.java:43)
	at jdk.internal.reflect.GeneratedMethodAccessor4.invoke(Unknown Source)
	at java.base/jdk.internal.reflect.DelegatingMethodAccessorImpl.invoke(DelegatingMethodAccessorImpl.java:43)
0.0
org.apache.cassandra.tcm.DiscoverySimulationTest-oa_jdk17_x86_64
Class Method Output Duration
tcm.DiscoverySimulationTest discoveryTest-oa_jdk17_x86_64
expected:<[/127.0.100.1:7012, /127.0.100.2:7012, /127.0.100.3:7012, /127.0.100.4:7012, /127.0.100.5:7012, /127.0.100.6:7012, /127.0.100.7:7012, /127.0.100.8:7012, /127.0.100.9:7012, /127.0.100.10:7012]> but was:<[/127.0.100.1:7012, /127.0.100.2:7012, /127.0.100.3:7012, /127.0.100.4:7012, /127.0.100.6:7012, /127.0.100.7:7012, /127.0.100.8:7012, /127.0.100.9:7012, /127.0.100.10:7012]>-junit.framework.AssertionFailedError: expected:<[/127.0.100.1:7012, /127.0.100.2:7012, /127.0.100.3:7012, /127.0.100.4:7012, /127.0.100.5:7012, /127.0.100.6:7012, /127.0.100.7:7012, /127.0.100.8:7012, /127.0.100.9:7012, /127.0.100.10:7012]> but was:<[/127.0.100.1:7012, /127.0.100.2:7012, /127.0.100.3:7012, /127.0.100.4:7012, /127.0.100.6:7012, /127.0.100.7:7012, /127.0.100.8:7012, /127.0.100.9:7012, /127.0.100.10:7012]>
	at org.apache.cassandra.tcm.DiscoverySimulationTest.discoveryTest(DiscoverySimulationTest.java:105)
	at java.base/jdk.internal.reflect.NativeMethodAccessorImpl.invoke0(Native Method)
	at java.base/jdk.internal.reflect.NativeMethodAccessorImpl.invoke(NativeMethodAccessorImpl.java:77)
	at java.base/jdk.internal.reflect.DelegatingMethodAccessorImpl.invoke(DelegatingMethodAccessorImpl.java:43)
48.052



[Test Suite Details]

Suites
Suite Passed Failed Skipped
cqlshlib.python3.8.jdk11.cython.x86_64 125 0 0
cqlshlib.python3.8.jdk11.no_cython.x86_64 125 0 0
dtest-large-novnode_jdk11_python3.8_cythonno_x86_64_1_8 5 0 0
dtest-large-novnode_jdk11_python3.8_cythonno_x86_64_2_8 5 0 0
dtest-large-novnode_jdk11_python3.8_cythonno_x86_64_3_8 5 0 0
dtest-large-novnode_jdk11_python3.8_cythonno_x86_64_4_8 4 0 1
dtest-large-novnode_jdk11_python3.8_cythonno_x86_64_5_8 5 0 0
dtest-large-novnode_jdk11_python3.8_cythonno_x86_64_6_8 4 0 1
dtest-large-novnode_jdk11_python3.8_cythonno_x86_64_7_8 3 0 1
dtest-large-novnode_jdk11_python3.8_cythonno_x86_64_8_8 4 0 0
dtest-large-novnode_jdk17_python3.8_cythonno_x86_64_1_8 5 0 0
dtest-large-novnode_jdk17_python3.8_cythonno_x86_64_2_8 5 0 0
dtest-large-novnode_jdk17_python3.8_cythonno_x86_64_3_8 5 0 0
dtest-large-novnode_jdk17_python3.8_cythonno_x86_64_4_8 4 0 1
dtest-large-novnode_jdk17_python3.8_cythonno_x86_64_5_8 5 0 0
dtest-large-novnode_jdk17_python3.8_cythonno_x86_64_6_8 4 0 1
dtest-large-novnode_jdk17_python3.8_cythonno_x86_64_7_8 3 0 1
dtest-large-novnode_jdk17_python3.8_cythonno_x86_64_8_8 4 0 0
dtest-large_jdk11_python3.8_cythonno_x86_64_1_8 4 0 1
dtest-large_jdk11_python3.8_cythonno_x86_64_2_8 5 0 0
dtest-large_jdk11_python3.8_cythonno_x86_64_3_8 5 0 0
dtest-large_jdk11_python3.8_cythonno_x86_64_4_8 3 0 1
dtest-large_jdk11_python3.8_cythonno_x86_64_5_8 3 0 1
dtest-large_jdk11_python3.8_cythonno_x86_64_6_8 4 0 0
dtest-large_jdk11_python3.8_cythonno_x86_64_7_8 4 0 0
dtest-large_jdk11_python3.8_cythonno_x86_64_8_8 4 0 0
dtest-large_jdk17_python3.8_cythonno_x86_64_1_8 4 0 1
dtest-large_jdk17_python3.8_cythonno_x86_64_2_8 5 0 0
dtest-large_jdk17_python3.8_cythonno_x86_64_3_8 5 0 0
dtest-large_jdk17_python3.8_cythonno_x86_64_4_8 3 0 1
dtest-large_jdk17_python3.8_cythonno_x86_64_5_8 3 0 1
dtest-large_jdk17_python3.8_cythonno_x86_64_6_8 4 0 0
dtest-large_jdk17_python3.8_cythonno_x86_64_7_8 4 0 0
dtest-large_jdk17_python3.8_cythonno_x86_64_8_8 4 0 0
dtest-latest_jdk11_python3.8_cythonno_x86_64_10_64 10 0 7
dtest-latest_jdk11_python3.8_cythonno_x86_64_11_64 11 0 6
dtest-latest_jdk11_python3.8_cythonno_x86_64_12_64 10 0 7
dtest-latest_jdk11_python3.8_cythonno_x86_64_13_64 12 0 5
dtest-latest_jdk11_python3.8_cythonno_x86_64_14_64 12 0 5
dtest-latest_jdk11_python3.8_cythonno_x86_64_15_64 13 0 4
dtest-latest_jdk11_python3.8_cythonno_x86_64_16_64 12 0 5
dtest-latest_jdk11_python3.8_cythonno_x86_64_17_64 11 0 6
dtest-latest_jdk11_python3.8_cythonno_x86_64_18_64 10 0 7
dtest-latest_jdk11_python3.8_cythonno_x86_64_19_64 11 0 6
dtest-latest_jdk11_python3.8_cythonno_x86_64_1_64 14 0 4
dtest-latest_jdk11_python3.8_cythonno_x86_64_20_64 12 0 5
dtest-latest_jdk11_python3.8_cythonno_x86_64_21_64 12 0 5
dtest-latest_jdk11_python3.8_cythonno_x86_64_22_64 13 0 4
dtest-latest_jdk11_python3.8_cythonno_x86_64_23_64 13 0 4
dtest-latest_jdk11_python3.8_cythonno_x86_64_24_64 13 0 4
dtest-latest_jdk11_python3.8_cythonno_x86_64_25_64 13 0 4
dtest-latest_jdk11_python3.8_cythonno_x86_64_26_64 14 0 3
dtest-latest_jdk11_python3.8_cythonno_x86_64_27_64 14 0 3
dtest-latest_jdk11_python3.8_cythonno_x86_64_28_64 11 0 6
dtest-latest_jdk11_python3.8_cythonno_x86_64_29_64 11 0 6
dtest-latest_jdk11_python3.8_cythonno_x86_64_2_64 14 0 4
dtest-latest_jdk11_python3.8_cythonno_x86_64_30_64 13 0 4
dtest-latest_jdk11_python3.8_cythonno_x86_64_31_64 13 1 3
dtest-latest_jdk11_python3.8_cythonno_x86_64_32_64 14 0 3
dtest-latest_jdk11_python3.8_cythonno_x86_64_33_64 13 0 4
dtest-latest_jdk11_python3.8_cythonno_x86_64_34_64 14 0 3
dtest-latest_jdk11_python3.8_cythonno_x86_64_35_64 13 0 4
dtest-latest_jdk11_python3.8_cythonno_x86_64_36_64 14 0 3
dtest-latest_jdk11_python3.8_cythonno_x86_64_37_64 14 0 3
dtest-latest_jdk11_python3.8_cythonno_x86_64_38_64 14 0 3
dtest-latest_jdk11_python3.8_cythonno_x86_64_39_64 11 0 6
dtest-latest_jdk11_python3.8_cythonno_x86_64_3_64 15 0 3
dtest-latest_jdk11_python3.8_cythonno_x86_64_40_64 13 0 4
dtest-latest_jdk11_python3.8_cythonno_x86_64_41_64 12 0 5
dtest-latest_jdk11_python3.8_cythonno_x86_64_42_64 13 0 4
dtest-latest_jdk11_python3.8_cythonno_x86_64_43_64 12 0 5
dtest-latest_jdk11_python3.8_cythonno_x86_64_44_64 13 0 4
dtest-latest_jdk11_python3.8_cythonno_x86_64_45_64 13 0 4
dtest-latest_jdk11_python3.8_cythonno_x86_64_46_64 13 0 4
dtest-latest_jdk11_python3.8_cythonno_x86_64_47_64 11 0 6
dtest-latest_jdk11_python3.8_cythonno_x86_64_48_64 11 0 6
dtest-latest_jdk11_python3.8_cythonno_x86_64_49_64 11 0 6
dtest-latest_jdk11_python3.8_cythonno_x86_64_4_64 14 0 3
dtest-latest_jdk11_python3.8_cythonno_x86_64_50_64 13 0 4
dtest-latest_jdk11_python3.8_cythonno_x86_64_51_64 14 0 3
dtest-latest_jdk11_python3.8_cythonno_x86_64_52_64 11 0 6
dtest-latest_jdk11_python3.8_cythonno_x86_64_53_64 11 0 6
dtest-latest_jdk11_python3.8_cythonno_x86_64_54_64 13 0 4
dtest-latest_jdk11_python3.8_cythonno_x86_64_55_64 13 0 4
dtest-latest_jdk11_python3.8_cythonno_x86_64_56_64 12 0 5
dtest-latest_jdk11_python3.8_cythonno_x86_64_57_64 14 0 3
dtest-latest_jdk11_python3.8_cythonno_x86_64_58_64 14 0 3
dtest-latest_jdk11_python3.8_cythonno_x86_64_59_64 14 0 3
dtest-latest_jdk11_python3.8_cythonno_x86_64_5_64 15 0 2
dtest-latest_jdk11_python3.8_cythonno_x86_64_60_64 13 0 4
dtest-latest_jdk11_python3.8_cythonno_x86_64_61_64 13 0 4
dtest-latest_jdk11_python3.8_cythonno_x86_64_62_64 14 0 3
dtest-latest_jdk11_python3.8_cythonno_x86_64_63_64 13 0 4
dtest-latest_jdk11_python3.8_cythonno_x86_64_64_64 14 0 3
dtest-latest_jdk11_python3.8_cythonno_x86_64_6_64 16 0 1
dtest-latest_jdk11_python3.8_cythonno_x86_64_7_64 13 0 4
dtest-latest_jdk11_python3.8_cythonno_x86_64_8_64 15 0 2
dtest-latest_jdk11_python3.8_cythonno_x86_64_9_64 12 0 5
dtest-latest_jdk17_python3.8_cythonno_x86_64_10_64 10 0 7
dtest-latest_jdk17_python3.8_cythonno_x86_64_11_64 11 0 6
dtest-latest_jdk17_python3.8_cythonno_x86_64_12_64 10 0 7
dtest-latest_jdk17_python3.8_cythonno_x86_64_13_64 12 0 5
dtest-latest_jdk17_python3.8_cythonno_x86_64_14_64 12 0 5
dtest-latest_jdk17_python3.8_cythonno_x86_64_15_64 13 0 4
dtest-latest_jdk17_python3.8_cythonno_x86_64_16_64 12 0 5
dtest-latest_jdk17_python3.8_cythonno_x86_64_17_64 11 0 6
dtest-latest_jdk17_python3.8_cythonno_x86_64_18_64 10 0 7
dtest-latest_jdk17_python3.8_cythonno_x86_64_19_64 11 0 6
dtest-latest_jdk17_python3.8_cythonno_x86_64_1_64 14 0 4
dtest-latest_jdk17_python3.8_cythonno_x86_64_20_64 12 0 5
dtest-latest_jdk17_python3.8_cythonno_x86_64_21_64 12 0 5
dtest-latest_jdk17_python3.8_cythonno_x86_64_22_64 13 0 4
dtest-latest_jdk17_python3.8_cythonno_x86_64_23_64 13 0 4
dtest-latest_jdk17_python3.8_cythonno_x86_64_24_64 13 0 4
dtest-latest_jdk17_python3.8_cythonno_x86_64_25_64 13 0 4
dtest-latest_jdk17_python3.8_cythonno_x86_64_26_64 14 0 3
dtest-latest_jdk17_python3.8_cythonno_x86_64_27_64 14 0 3
dtest-latest_jdk17_python3.8_cythonno_x86_64_28_64 11 0 6
dtest-latest_jdk17_python3.8_cythonno_x86_64_29_64 11 0 6
dtest-latest_jdk17_python3.8_cythonno_x86_64_2_64 14 0 4
dtest-latest_jdk17_python3.8_cythonno_x86_64_30_64 13 0 4
dtest-latest_jdk17_python3.8_cythonno_x86_64_31_64 13 1 3
dtest-latest_jdk17_python3.8_cythonno_x86_64_32_64 14 0 3
dtest-latest_jdk17_python3.8_cythonno_x86_64_33_64 13 0 4
dtest-latest_jdk17_python3.8_cythonno_x86_64_34_64 14 0 3
dtest-latest_jdk17_python3.8_cythonno_x86_64_35_64 13 0 4
dtest-latest_jdk17_python3.8_cythonno_x86_64_36_64 14 0 3
dtest-latest_jdk17_python3.8_cythonno_x86_64_37_64 14 0 3
dtest-latest_jdk17_python3.8_cythonno_x86_64_38_64 14 0 3
dtest-latest_jdk17_python3.8_cythonno_x86_64_39_64 11 0 6
dtest-latest_jdk17_python3.8_cythonno_x86_64_3_64 15 0 3
dtest-latest_jdk17_python3.8_cythonno_x86_64_40_64 13 0 4
dtest-latest_jdk17_python3.8_cythonno_x86_64_41_64 12 0 5
dtest-latest_jdk17_python3.8_cythonno_x86_64_42_64 13 0 4
dtest-latest_jdk17_python3.8_cythonno_x86_64_43_64 12 0 5
dtest-latest_jdk17_python3.8_cythonno_x86_64_44_64 13 0 4
dtest-latest_jdk17_python3.8_cythonno_x86_64_45_64 13 0 4
dtest-latest_jdk17_python3.8_cythonno_x86_64_46_64 13 0 4
dtest-latest_jdk17_python3.8_cythonno_x86_64_47_64 11 0 6
dtest-latest_jdk17_python3.8_cythonno_x86_64_48_64 11 0 6
dtest-latest_jdk17_python3.8_cythonno_x86_64_49_64 11 0 6
dtest-latest_jdk17_python3.8_cythonno_x86_64_4_64 14 0 3
dtest-latest_jdk17_python3.8_cythonno_x86_64_50_64 13 0 4
dtest-latest_jdk17_python3.8_cythonno_x86_64_51_64 14 0 3
dtest-latest_jdk17_python3.8_cythonno_x86_64_52_64 11 0 6
dtest-latest_jdk17_python3.8_cythonno_x86_64_53_64 11 0 6
dtest-latest_jdk17_python3.8_cythonno_x86_64_54_64 13 0 4
dtest-latest_jdk17_python3.8_cythonno_x86_64_55_64 13 0 4
dtest-latest_jdk17_python3.8_cythonno_x86_64_56_64 12 0 5
dtest-latest_jdk17_python3.8_cythonno_x86_64_57_64 14 0 3
dtest-latest_jdk17_python3.8_cythonno_x86_64_58_64 14 0 3
dtest-latest_jdk17_python3.8_cythonno_x86_64_59_64 14 0 3
dtest-latest_jdk17_python3.8_cythonno_x86_64_5_64 15 0 2
dtest-latest_jdk17_python3.8_cythonno_x86_64_60_64 13 0 4
dtest-latest_jdk17_python3.8_cythonno_x86_64_61_64 13 0 4
dtest-latest_jdk17_python3.8_cythonno_x86_64_62_64 14 0 3
dtest-latest_jdk17_python3.8_cythonno_x86_64_63_64 13 0 4
dtest-latest_jdk17_python3.8_cythonno_x86_64_64_64 14 0 3
dtest-latest_jdk17_python3.8_cythonno_x86_64_6_64 16 0 1
dtest-latest_jdk17_python3.8_cythonno_x86_64_7_64 13 0 4
dtest-latest_jdk17_python3.8_cythonno_x86_64_8_64 15 0 2
dtest-latest_jdk17_python3.8_cythonno_x86_64_9_64 12 0 5
dtest-novnode_jdk11_python3.8_cythonno_x86_64_10_64 16 0 2
dtest-novnode_jdk11_python3.8_cythonno_x86_64_11_64 15 0 3
dtest-novnode_jdk11_python3.8_cythonno_x86_64_12_64 14 0 4
dtest-novnode_jdk11_python3.8_cythonno_x86_64_13_64 12 0 6
dtest-novnode_jdk11_python3.8_cythonno_x86_64_14_64 15 0 3
dtest-novnode_jdk11_python3.8_cythonno_x86_64_15_64 15 0 3
dtest-novnode_jdk11_python3.8_cythonno_x86_64_16_64 14 0 4
dtest-novnode_jdk11_python3.8_cythonno_x86_64_17_64 16 0 2
dtest-novnode_jdk11_python3.8_cythonno_x86_64_18_64 14 0 4
dtest-novnode_jdk11_python3.8_cythonno_x86_64_19_64 15 0 3
dtest-novnode_jdk11_python3.8_cythonno_x86_64_1_64 11 0 7
dtest-novnode_jdk11_python3.8_cythonno_x86_64_20_64 13 0 5
dtest-novnode_jdk11_python3.8_cythonno_x86_64_21_64 15 0 3
dtest-novnode_jdk11_python3.8_cythonno_x86_64_22_64 14 0 4
dtest-novnode_jdk11_python3.8_cythonno_x86_64_23_64 11 0 7
dtest-novnode_jdk11_python3.8_cythonno_x86_64_24_64 13 0 5
dtest-novnode_jdk11_python3.8_cythonno_x86_64_25_64 12 0 6
dtest-novnode_jdk11_python3.8_cythonno_x86_64_26_64 13 0 5
dtest-novnode_jdk11_python3.8_cythonno_x86_64_27_64 13 0 5
dtest-novnode_jdk11_python3.8_cythonno_x86_64_28_64 14 0 4
dtest-novnode_jdk11_python3.8_cythonno_x86_64_29_64 13 0 5
dtest-novnode_jdk11_python3.8_cythonno_x86_64_2_64 12 0 6
dtest-novnode_jdk11_python3.8_cythonno_x86_64_30_64 13 0 5
dtest-novnode_jdk11_python3.8_cythonno_x86_64_31_64 12 0 6
dtest-novnode_jdk11_python3.8_cythonno_x86_64_32_64 13 0 5
dtest-novnode_jdk11_python3.8_cythonno_x86_64_33_64 13 0 5
dtest-novnode_jdk11_python3.8_cythonno_x86_64_34_64 13 0 5
dtest-novnode_jdk11_python3.8_cythonno_x86_64_35_64 16 0 2
dtest-novnode_jdk11_python3.8_cythonno_x86_64_36_64 15 0 3
dtest-novnode_jdk11_python3.8_cythonno_x86_64_37_64 14 0 4
dtest-novnode_jdk11_python3.8_cythonno_x86_64_38_64 15 0 3
dtest-novnode_jdk11_python3.8_cythonno_x86_64_39_64 15 0 3
dtest-novnode_jdk11_python3.8_cythonno_x86_64_3_64 13 0 5
dtest-novnode_jdk11_python3.8_cythonno_x86_64_40_64 16 0 2
dtest-novnode_jdk11_python3.8_cythonno_x86_64_41_64 16 0 2
dtest-novnode_jdk11_python3.8_cythonno_x86_64_42_64 15 0 3
dtest-novnode_jdk11_python3.8_cythonno_x86_64_43_64 15 0 3
dtest-novnode_jdk11_python3.8_cythonno_x86_64_44_64 13 0 5
dtest-novnode_jdk11_python3.8_cythonno_x86_64_45_64 14 0 4
dtest-novnode_jdk11_python3.8_cythonno_x86_64_46_64 14 0 4
dtest-novnode_jdk11_python3.8_cythonno_x86_64_47_64 14 0 4
dtest-novnode_jdk11_python3.8_cythonno_x86_64_48_64 14 0 4
dtest-novnode_jdk11_python3.8_cythonno_x86_64_49_64 14 0 4
dtest-novnode_jdk11_python3.8_cythonno_x86_64_4_64 14 0 4
dtest-novnode_jdk11_python3.8_cythonno_x86_64_50_64 14 0 4
dtest-novnode_jdk11_python3.8_cythonno_x86_64_51_64 13 0 5
dtest-novnode_jdk11_python3.8_cythonno_x86_64_52_64 12 0 6
dtest-novnode_jdk11_python3.8_cythonno_x86_64_53_64 11 0 7
dtest-novnode_jdk11_python3.8_cythonno_x86_64_54_64 13 0 5
dtest-novnode_jdk11_python3.8_cythonno_x86_64_55_64 15 0 3
dtest-novnode_jdk11_python3.8_cythonno_x86_64_56_64 15 0 3
dtest-novnode_jdk11_python3.8_cythonno_x86_64_57_64 12 0 6
dtest-novnode_jdk11_python3.8_cythonno_x86_64_58_64 11 0 7
dtest-novnode_jdk11_python3.8_cythonno_x86_64_59_64 14 0 4
dtest-novnode_jdk11_python3.8_cythonno_x86_64_5_64 13 0 5
dtest-novnode_jdk11_python3.8_cythonno_x86_64_60_64 13 0 5
dtest-novnode_jdk11_python3.8_cythonno_x86_64_61_64 12 0 6
dtest-novnode_jdk11_python3.8_cythonno_x86_64_62_64 14 0 4
dtest-novnode_jdk11_python3.8_cythonno_x86_64_63_64 9 0 8
dtest-novnode_jdk11_python3.8_cythonno_x86_64_64_64 11 0 6
dtest-novnode_jdk11_python3.8_cythonno_x86_64_6_64 14 0 4
dtest-novnode_jdk11_python3.8_cythonno_x86_64_7_64 16 0 2
dtest-novnode_jdk11_python3.8_cythonno_x86_64_8_64 16 0 2
dtest-novnode_jdk11_python3.8_cythonno_x86_64_9_64 16 0 2
dtest-novnode_jdk17_python3.8_cythonno_x86_64_10_64 16 0 2
dtest-novnode_jdk17_python3.8_cythonno_x86_64_11_64 15 0 3
dtest-novnode_jdk17_python3.8_cythonno_x86_64_12_64 14 0 4
dtest-novnode_jdk17_python3.8_cythonno_x86_64_13_64 12 0 6
dtest-novnode_jdk17_python3.8_cythonno_x86_64_14_64 15 0 3
dtest-novnode_jdk17_python3.8_cythonno_x86_64_15_64 15 0 3
dtest-novnode_jdk17_python3.8_cythonno_x86_64_16_64 14 0 4
dtest-novnode_jdk17_python3.8_cythonno_x86_64_17_64 16 0 2
dtest-novnode_jdk17_python3.8_cythonno_x86_64_18_64 14 0 4
dtest-novnode_jdk17_python3.8_cythonno_x86_64_19_64 15 0 3
dtest-novnode_jdk17_python3.8_cythonno_x86_64_1_64 11 0 7
dtest-novnode_jdk17_python3.8_cythonno_x86_64_20_64 13 0 5
dtest-novnode_jdk17_python3.8_cythonno_x86_64_21_64 15 0 3
dtest-novnode_jdk17_python3.8_cythonno_x86_64_22_64 14 0 4
dtest-novnode_jdk17_python3.8_cythonno_x86_64_23_64 11 0 7
dtest-novnode_jdk17_python3.8_cythonno_x86_64_24_64 13 0 5
dtest-novnode_jdk17_python3.8_cythonno_x86_64_25_64 12 0 6
dtest-novnode_jdk17_python3.8_cythonno_x86_64_26_64 13 0 5
dtest-novnode_jdk17_python3.8_cythonno_x86_64_27_64 13 0 5
dtest-novnode_jdk17_python3.8_cythonno_x86_64_28_64 14 0 4
dtest-novnode_jdk17_python3.8_cythonno_x86_64_29_64 13 0 5
dtest-novnode_jdk17_python3.8_cythonno_x86_64_2_64 12 0 6
dtest-novnode_jdk17_python3.8_cythonno_x86_64_30_64 13 0 5
dtest-novnode_jdk17_python3.8_cythonno_x86_64_31_64 12 0 6
dtest-novnode_jdk17_python3.8_cythonno_x86_64_32_64 13 0 5
dtest-novnode_jdk17_python3.8_cythonno_x86_64_33_64 13 0 5
dtest-novnode_jdk17_python3.8_cythonno_x86_64_34_64 13 0 5
dtest-novnode_jdk17_python3.8_cythonno_x86_64_35_64 16 0 2
dtest-novnode_jdk17_python3.8_cythonno_x86_64_36_64 15 0 3
dtest-novnode_jdk17_python3.8_cythonno_x86_64_37_64 14 0 4
dtest-novnode_jdk17_python3.8_cythonno_x86_64_38_64 15 0 3
dtest-novnode_jdk17_python3.8_cythonno_x86_64_39_64 15 0 3
dtest-novnode_jdk17_python3.8_cythonno_x86_64_3_64 13 0 5
dtest-novnode_jdk17_python3.8_cythonno_x86_64_40_64 16 0 2
dtest-novnode_jdk17_python3.8_cythonno_x86_64_41_64 16 0 2
dtest-novnode_jdk17_python3.8_cythonno_x86_64_42_64 15 0 3
dtest-novnode_jdk17_python3.8_cythonno_x86_64_43_64 15 0 3
dtest-novnode_jdk17_python3.8_cythonno_x86_64_44_64 13 0 5
dtest-novnode_jdk17_python3.8_cythonno_x86_64_45_64 14 0 4
dtest-novnode_jdk17_python3.8_cythonno_x86_64_46_64 14 0 4
dtest-novnode_jdk17_python3.8_cythonno_x86_64_47_64 14 0 4
dtest-novnode_jdk17_python3.8_cythonno_x86_64_48_64 14 0 4
dtest-novnode_jdk17_python3.8_cythonno_x86_64_49_64 14 0 4
dtest-novnode_jdk17_python3.8_cythonno_x86_64_4_64 14 0 4
dtest-novnode_jdk17_python3.8_cythonno_x86_64_50_64 14 0 4
dtest-novnode_jdk17_python3.8_cythonno_x86_64_51_64 13 0 5
dtest-novnode_jdk17_python3.8_cythonno_x86_64_52_64 12 0 6
dtest-novnode_jdk17_python3.8_cythonno_x86_64_53_64 11 0 7
dtest-novnode_jdk17_python3.8_cythonno_x86_64_54_64 13 0 5
dtest-novnode_jdk17_python3.8_cythonno_x86_64_55_64 15 0 3
dtest-novnode_jdk17_python3.8_cythonno_x86_64_56_64 15 0 3
dtest-novnode_jdk17_python3.8_cythonno_x86_64_57_64 12 0 6
dtest-novnode_jdk17_python3.8_cythonno_x86_64_58_64 11 0 7
dtest-novnode_jdk17_python3.8_cythonno_x86_64_59_64 14 0 4
dtest-novnode_jdk17_python3.8_cythonno_x86_64_5_64 13 0 5
dtest-novnode_jdk17_python3.8_cythonno_x86_64_60_64 13 0 5
dtest-novnode_jdk17_python3.8_cythonno_x86_64_61_64 12 0 6
dtest-novnode_jdk17_python3.8_cythonno_x86_64_62_64 14 0 4
dtest-novnode_jdk17_python3.8_cythonno_x86_64_63_64 9 0 8
dtest-novnode_jdk17_python3.8_cythonno_x86_64_64_64 11 0 6
dtest-novnode_jdk17_python3.8_cythonno_x86_64_6_64 14 0 4
dtest-novnode_jdk17_python3.8_cythonno_x86_64_7_64 16 0 2
dtest-novnode_jdk17_python3.8_cythonno_x86_64_8_64 16 0 2
dtest-novnode_jdk17_python3.8_cythonno_x86_64_9_64 16 0 2
dtest-upgrade-large_jdk11_python3.8_cythonno_x86_64_10_64 1 0 0
dtest-upgrade-large_jdk11_python3.8_cythonno_x86_64_11_64 1 0 0
dtest-upgrade-large_jdk11_python3.8_cythonno_x86_64_12_64 1 0 0
dtest-upgrade-large_jdk11_python3.8_cythonno_x86_64_13_64 1 0 0
dtest-upgrade-large_jdk11_python3.8_cythonno_x86_64_14_64 1 0 0
dtest-upgrade-large_jdk11_python3.8_cythonno_x86_64_15_64 1 0 0
dtest-upgrade-large_jdk11_python3.8_cythonno_x86_64_16_64 1 0 0
dtest-upgrade-large_jdk11_python3.8_cythonno_x86_64_17_64 1 0 0
dtest-upgrade-large_jdk11_python3.8_cythonno_x86_64_18_64 1 0 0
dtest-upgrade-large_jdk11_python3.8_cythonno_x86_64_19_64 1 0 0
dtest-upgrade-large_jdk11_python3.8_cythonno_x86_64_1_64 0 0 1
dtest-upgrade-large_jdk11_python3.8_cythonno_x86_64_20_64 1 0 0
dtest-upgrade-large_jdk11_python3.8_cythonno_x86_64_21_64 1 0 0
dtest-upgrade-large_jdk11_python3.8_cythonno_x86_64_22_64 1 0 0
dtest-upgrade-large_jdk11_python3.8_cythonno_x86_64_23_64 1 0 0
dtest-upgrade-large_jdk11_python3.8_cythonno_x86_64_24_64 1 0 0
dtest-upgrade-large_jdk11_python3.8_cythonno_x86_64_25_64 1 0 0
dtest-upgrade-large_jdk11_python3.8_cythonno_x86_64_26_64 1 0 0
dtest-upgrade-large_jdk11_python3.8_cythonno_x86_64_27_64 1 0 0
dtest-upgrade-large_jdk11_python3.8_cythonno_x86_64_28_64 1 0 0
dtest-upgrade-large_jdk11_python3.8_cythonno_x86_64_29_64 1 0 0
dtest-upgrade-large_jdk11_python3.8_cythonno_x86_64_2_64 0 0 1
dtest-upgrade-large_jdk11_python3.8_cythonno_x86_64_30_64 1 0 0
dtest-upgrade-large_jdk11_python3.8_cythonno_x86_64_31_64 1 0 0
dtest-upgrade-large_jdk11_python3.8_cythonno_x86_64_32_64 1 0 0
dtest-upgrade-large_jdk11_python3.8_cythonno_x86_64_33_64 1 0 0
dtest-upgrade-large_jdk11_python3.8_cythonno_x86_64_34_64 1 0 0
dtest-upgrade-large_jdk11_python3.8_cythonno_x86_64_35_64 1 0 0
dtest-upgrade-large_jdk11_python3.8_cythonno_x86_64_36_64 1 0 0
dtest-upgrade-large_jdk11_python3.8_cythonno_x86_64_37_64 1 0 0
dtest-upgrade-large_jdk11_python3.8_cythonno_x86_64_38_64 1 0 0
dtest-upgrade-large_jdk11_python3.8_cythonno_x86_64_39_64 1 0 0
dtest-upgrade-large_jdk11_python3.8_cythonno_x86_64_3_64 0 0 1
dtest-upgrade-large_jdk11_python3.8_cythonno_x86_64_40_64 1 0 0
dtest-upgrade-large_jdk11_python3.8_cythonno_x86_64_41_64 1 0 0
dtest-upgrade-large_jdk11_python3.8_cythonno_x86_64_42_64 1 0 0
dtest-upgrade-large_jdk11_python3.8_cythonno_x86_64_43_64 1 0 0
dtest-upgrade-large_jdk11_python3.8_cythonno_x86_64_44_64 1 0 0
dtest-upgrade-large_jdk11_python3.8_cythonno_x86_64_45_64 1 0 0
dtest-upgrade-large_jdk11_python3.8_cythonno_x86_64_46_64 1 0 0
dtest-upgrade-large_jdk11_python3.8_cythonno_x86_64_47_64 1 0 0
dtest-upgrade-large_jdk11_python3.8_cythonno_x86_64_48_64 1 0 0
dtest-upgrade-large_jdk11_python3.8_cythonno_x86_64_49_64 1 0 0
dtest-upgrade-large_jdk11_python3.8_cythonno_x86_64_4_64 0 0 1
dtest-upgrade-large_jdk11_python3.8_cythonno_x86_64_50_64 1 0 0
dtest-upgrade-large_jdk11_python3.8_cythonno_x86_64_51_64 1 0 0
dtest-upgrade-large_jdk11_python3.8_cythonno_x86_64_52_64 1 0 0
dtest-upgrade-large_jdk11_python3.8_cythonno_x86_64_53_64 1 0 0
dtest-upgrade-large_jdk11_python3.8_cythonno_x86_64_54_64 1 0 0
dtest-upgrade-large_jdk11_python3.8_cythonno_x86_64_55_64 1 0 0
dtest-upgrade-large_jdk11_python3.8_cythonno_x86_64_56_64 1 0 0
dtest-upgrade-large_jdk11_python3.8_cythonno_x86_64_57_64 1 0 0
dtest-upgrade-large_jdk11_python3.8_cythonno_x86_64_58_64 1 0 0
dtest-upgrade-large_jdk11_python3.8_cythonno_x86_64_59_64 1 0 0
dtest-upgrade-large_jdk11_python3.8_cythonno_x86_64_5_64 1 0 0
dtest-upgrade-large_jdk11_python3.8_cythonno_x86_64_60_64 1 0 0
dtest-upgrade-large_jdk11_python3.8_cythonno_x86_64_61_64 1 0 0
dtest-upgrade-large_jdk11_python3.8_cythonno_x86_64_62_64 1 0 0
dtest-upgrade-large_jdk11_python3.8_cythonno_x86_64_63_64 1 0 0
dtest-upgrade-large_jdk11_python3.8_cythonno_x86_64_64_64 1 0 0
dtest-upgrade-large_jdk11_python3.8_cythonno_x86_64_6_64 1 0 0
dtest-upgrade-large_jdk11_python3.8_cythonno_x86_64_7_64 1 0 0
dtest-upgrade-large_jdk11_python3.8_cythonno_x86_64_8_64 1 0 0
dtest-upgrade-large_jdk11_python3.8_cythonno_x86_64_9_64 1 0 0
dtest-upgrade-novnode-large_jdk11_python3.8_cythonno_x86_64_10_64 1 0 0
dtest-upgrade-novnode-large_jdk11_python3.8_cythonno_x86_64_11_64 1 0 0
dtest-upgrade-novnode-large_jdk11_python3.8_cythonno_x86_64_12_64 1 0 0
dtest-upgrade-novnode-large_jdk11_python3.8_cythonno_x86_64_13_64 1 0 0
dtest-upgrade-novnode-large_jdk11_python3.8_cythonno_x86_64_14_64 1 0 0
dtest-upgrade-novnode-large_jdk11_python3.8_cythonno_x86_64_15_64 1 0 0
dtest-upgrade-novnode-large_jdk11_python3.8_cythonno_x86_64_16_64 1 0 0
dtest-upgrade-novnode-large_jdk11_python3.8_cythonno_x86_64_17_64 1 0 0
dtest-upgrade-novnode-large_jdk11_python3.8_cythonno_x86_64_18_64 1 0 0
dtest-upgrade-novnode-large_jdk11_python3.8_cythonno_x86_64_19_64 1 0 0
dtest-upgrade-novnode-large_jdk11_python3.8_cythonno_x86_64_1_64 0 0 1
dtest-upgrade-novnode-large_jdk11_python3.8_cythonno_x86_64_20_64 1 0 0
dtest-upgrade-novnode-large_jdk11_python3.8_cythonno_x86_64_21_64 1 0 0
dtest-upgrade-novnode-large_jdk11_python3.8_cythonno_x86_64_22_64 1 0 0
dtest-upgrade-novnode-large_jdk11_python3.8_cythonno_x86_64_23_64 1 0 0
dtest-upgrade-novnode-large_jdk11_python3.8_cythonno_x86_64_24_64 1 0 0
dtest-upgrade-novnode-large_jdk11_python3.8_cythonno_x86_64_25_64 1 0 0
dtest-upgrade-novnode-large_jdk11_python3.8_cythonno_x86_64_26_64 1 0 0
dtest-upgrade-novnode-large_jdk11_python3.8_cythonno_x86_64_27_64 1 0 0
dtest-upgrade-novnode-large_jdk11_python3.8_cythonno_x86_64_28_64 1 0 0
dtest-upgrade-novnode-large_jdk11_python3.8_cythonno_x86_64_29_64 1 0 0
dtest-upgrade-novnode-large_jdk11_python3.8_cythonno_x86_64_2_64 0 0 1
dtest-upgrade-novnode-large_jdk11_python3.8_cythonno_x86_64_30_64 1 0 0
dtest-upgrade-novnode-large_jdk11_python3.8_cythonno_x86_64_31_64 1 0 0
dtest-upgrade-novnode-large_jdk11_python3.8_cythonno_x86_64_32_64 1 0 0
dtest-upgrade-novnode-large_jdk11_python3.8_cythonno_x86_64_33_64 1 0 0
dtest-upgrade-novnode-large_jdk11_python3.8_cythonno_x86_64_34_64 1 0 0
dtest-upgrade-novnode-large_jdk11_python3.8_cythonno_x86_64_35_64 1 0 0
dtest-upgrade-novnode-large_jdk11_python3.8_cythonno_x86_64_36_64 1 0 0
dtest-upgrade-novnode-large_jdk11_python3.8_cythonno_x86_64_37_64 1 0 0
dtest-upgrade-novnode-large_jdk11_python3.8_cythonno_x86_64_38_64 1 0 0
dtest-upgrade-novnode-large_jdk11_python3.8_cythonno_x86_64_39_64 1 0 0
dtest-upgrade-novnode-large_jdk11_python3.8_cythonno_x86_64_3_64 0 0 1
dtest-upgrade-novnode-large_jdk11_python3.8_cythonno_x86_64_40_64 1 0 0
dtest-upgrade-novnode-large_jdk11_python3.8_cythonno_x86_64_41_64 1 0 0
dtest-upgrade-novnode-large_jdk11_python3.8_cythonno_x86_64_42_64 1 0 0
dtest-upgrade-novnode-large_jdk11_python3.8_cythonno_x86_64_43_64 1 0 0
dtest-upgrade-novnode-large_jdk11_python3.8_cythonno_x86_64_44_64 1 0 0
dtest-upgrade-novnode-large_jdk11_python3.8_cythonno_x86_64_45_64 1 0 0
dtest-upgrade-novnode-large_jdk11_python3.8_cythonno_x86_64_46_64 1 0 0
dtest-upgrade-novnode-large_jdk11_python3.8_cythonno_x86_64_47_64 1 0 0
dtest-upgrade-novnode-large_jdk11_python3.8_cythonno_x86_64_48_64 1 0 0
dtest-upgrade-novnode-large_jdk11_python3.8_cythonno_x86_64_49_64 1 0 0
dtest-upgrade-novnode-large_jdk11_python3.8_cythonno_x86_64_4_64 0 0 1
dtest-upgrade-novnode-large_jdk11_python3.8_cythonno_x86_64_50_64 1 0 0
dtest-upgrade-novnode-large_jdk11_python3.8_cythonno_x86_64_51_64 1 0 0
dtest-upgrade-novnode-large_jdk11_python3.8_cythonno_x86_64_52_64 1 0 0
dtest-upgrade-novnode-large_jdk11_python3.8_cythonno_x86_64_53_64 1 0 0
dtest-upgrade-novnode-large_jdk11_python3.8_cythonno_x86_64_54_64 1 0 0
dtest-upgrade-novnode-large_jdk11_python3.8_cythonno_x86_64_55_64 1 0 0
dtest-upgrade-novnode-large_jdk11_python3.8_cythonno_x86_64_56_64 1 0 0
dtest-upgrade-novnode-large_jdk11_python3.8_cythonno_x86_64_57_64 1 0 0
dtest-upgrade-novnode-large_jdk11_python3.8_cythonno_x86_64_58_64 1 0 0
dtest-upgrade-novnode-large_jdk11_python3.8_cythonno_x86_64_59_64 1 0 0
dtest-upgrade-novnode-large_jdk11_python3.8_cythonno_x86_64_5_64 1 0 0
dtest-upgrade-novnode-large_jdk11_python3.8_cythonno_x86_64_60_64 1 0 0
dtest-upgrade-novnode-large_jdk11_python3.8_cythonno_x86_64_61_64 1 0 0
dtest-upgrade-novnode-large_jdk11_python3.8_cythonno_x86_64_62_64 1 0 0
dtest-upgrade-novnode-large_jdk11_python3.8_cythonno_x86_64_63_64 1 0 0
dtest-upgrade-novnode-large_jdk11_python3.8_cythonno_x86_64_64_64 1 0 0
dtest-upgrade-novnode-large_jdk11_python3.8_cythonno_x86_64_6_64 1 0 0
dtest-upgrade-novnode-large_jdk11_python3.8_cythonno_x86_64_7_64 1 0 0
dtest-upgrade-novnode-large_jdk11_python3.8_cythonno_x86_64_8_64 1 0 0
dtest-upgrade-novnode-large_jdk11_python3.8_cythonno_x86_64_9_64 1 0 0
dtest-upgrade-novnode_jdk11_python3.8_cythonno_x86_64_10_64 33 0 7
dtest-upgrade-novnode_jdk11_python3.8_cythonno_x86_64_11_64 36 0 4
dtest-upgrade-novnode_jdk11_python3.8_cythonno_x86_64_12_64 36 0 4
dtest-upgrade-novnode_jdk11_python3.8_cythonno_x86_64_13_64 33 0 7
dtest-upgrade-novnode_jdk11_python3.8_cythonno_x86_64_14_64 36 0 4
dtest-upgrade-novnode_jdk11_python3.8_cythonno_x86_64_15_64 36 0 4
dtest-upgrade-novnode_jdk11_python3.8_cythonno_x86_64_16_64 34 0 6
dtest-upgrade-novnode_jdk11_python3.8_cythonno_x86_64_17_64 32 0 8
dtest-upgrade-novnode_jdk11_python3.8_cythonno_x86_64_18_64 34 0 6
dtest-upgrade-novnode_jdk11_python3.8_cythonno_x86_64_19_64 34 0 6
dtest-upgrade-novnode_jdk11_python3.8_cythonno_x86_64_1_64 31 0 10
dtest-upgrade-novnode_jdk11_python3.8_cythonno_x86_64_20_64 34 0 6
dtest-upgrade-novnode_jdk11_python3.8_cythonno_x86_64_21_64 32 0 8
dtest-upgrade-novnode_jdk11_python3.8_cythonno_x86_64_22_64 35 0 5
dtest-upgrade-novnode_jdk11_python3.8_cythonno_x86_64_23_64 35 0 5
dtest-upgrade-novnode_jdk11_python3.8_cythonno_x86_64_24_64 36 0 4
dtest-upgrade-novnode_jdk11_python3.8_cythonno_x86_64_25_64 34 0 6
dtest-upgrade-novnode_jdk11_python3.8_cythonno_x86_64_26_64 35 0 5
dtest-upgrade-novnode_jdk11_python3.8_cythonno_x86_64_27_64 35 0 5
dtest-upgrade-novnode_jdk11_python3.8_cythonno_x86_64_28_64 35 0 5
dtest-upgrade-novnode_jdk11_python3.8_cythonno_x86_64_29_64 34 0 6
dtest-upgrade-novnode_jdk11_python3.8_cythonno_x86_64_2_64 34 0 7
dtest-upgrade-novnode_jdk11_python3.8_cythonno_x86_64_30_64 33 0 7
dtest-upgrade-novnode_jdk11_python3.8_cythonno_x86_64_31_64 35 0 5
dtest-upgrade-novnode_jdk11_python3.8_cythonno_x86_64_32_64 35 0 5
dtest-upgrade-novnode_jdk11_python3.8_cythonno_x86_64_33_64 33 0 7
dtest-upgrade-novnode_jdk11_python3.8_cythonno_x86_64_34_64 35 0 5
dtest-upgrade-novnode_jdk11_python3.8_cythonno_x86_64_35_64 35 0 5
dtest-upgrade-novnode_jdk11_python3.8_cythonno_x86_64_36_64 36 0 4
dtest-upgrade-novnode_jdk11_python3.8_cythonno_x86_64_37_64 32 0 8
dtest-upgrade-novnode_jdk11_python3.8_cythonno_x86_64_38_64 34 0 6
dtest-upgrade-novnode_jdk11_python3.8_cythonno_x86_64_39_64 35 0 5
dtest-upgrade-novnode_jdk11_python3.8_cythonno_x86_64_3_64 34 0 7
dtest-upgrade-novnode_jdk11_python3.8_cythonno_x86_64_40_64 35 0 5
dtest-upgrade-novnode_jdk11_python3.8_cythonno_x86_64_41_64 32 0 8
dtest-upgrade-novnode_jdk11_python3.8_cythonno_x86_64_42_64 34 0 6
dtest-upgrade-novnode_jdk11_python3.8_cythonno_x86_64_43_64 35 0 5
dtest-upgrade-novnode_jdk11_python3.8_cythonno_x86_64_44_64 35 0 5
dtest-upgrade-novnode_jdk11_python3.8_cythonno_x86_64_45_64 33 0 7
dtest-upgrade-novnode_jdk11_python3.8_cythonno_x86_64_46_64 35 0 5
dtest-upgrade-novnode_jdk11_python3.8_cythonno_x86_64_47_64 34 0 6
dtest-upgrade-novnode_jdk11_python3.8_cythonno_x86_64_48_64 36 0 4
dtest-upgrade-novnode_jdk11_python3.8_cythonno_x86_64_49_64 32 0 8
dtest-upgrade-novnode_jdk11_python3.8_cythonno_x86_64_4_64 34 0 7
dtest-upgrade-novnode_jdk11_python3.8_cythonno_x86_64_50_64 34 0 6
dtest-upgrade-novnode_jdk11_python3.8_cythonno_x86_64_51_64 35 0 5
dtest-upgrade-novnode_jdk11_python3.8_cythonno_x86_64_52_64 35 0 5
dtest-upgrade-novnode_jdk11_python3.8_cythonno_x86_64_53_64 34 0 6
dtest-upgrade-novnode_jdk11_python3.8_cythonno_x86_64_54_64 34 0 6
dtest-upgrade-novnode_jdk11_python3.8_cythonno_x86_64_55_64 35 0 5
dtest-upgrade-novnode_jdk11_python3.8_cythonno_x86_64_56_64 35 0 5
dtest-upgrade-novnode_jdk11_python3.8_cythonno_x86_64_57_64 32 0 8
dtest-upgrade-novnode_jdk11_python3.8_cythonno_x86_64_58_64 34 0 6
dtest-upgrade-novnode_jdk11_python3.8_cythonno_x86_64_59_64 35 0 5
dtest-upgrade-novnode_jdk11_python3.8_cythonno_x86_64_5_64 33 0 8
dtest-upgrade-novnode_jdk11_python3.8_cythonno_x86_64_60_64 33 0 7
dtest-upgrade-novnode_jdk11_python3.8_cythonno_x86_64_61_64 30 0 10
dtest-upgrade-novnode_jdk11_python3.8_cythonno_x86_64_62_64 32 0 8
dtest-upgrade-novnode_jdk11_python3.8_cythonno_x86_64_63_64 33 0 7
dtest-upgrade-novnode_jdk11_python3.8_cythonno_x86_64_64_64 34 0 6
dtest-upgrade-novnode_jdk11_python3.8_cythonno_x86_64_6_64 35 0 6
dtest-upgrade-novnode_jdk11_python3.8_cythonno_x86_64_7_64 35 0 6
dtest-upgrade-novnode_jdk11_python3.8_cythonno_x86_64_8_64 36 0 5
dtest-upgrade-novnode_jdk11_python3.8_cythonno_x86_64_9_64 34 0 7
dtest-upgrade_jdk11_python3.8_cythonno_x86_64_10_64 34 1 3
dtest-upgrade_jdk11_python3.8_cythonno_x86_64_11_64 35 0 3
dtest-upgrade_jdk11_python3.8_cythonno_x86_64_12_64 28 0 10
dtest-upgrade_jdk11_python3.8_cythonno_x86_64_13_64 31 0 7
dtest-upgrade_jdk11_python3.8_cythonno_x86_64_14_64 35 0 3
dtest-upgrade_jdk11_python3.8_cythonno_x86_64_15_64 34 0 4
dtest-upgrade_jdk11_python3.8_cythonno_x86_64_16_64 31 0 7
dtest-upgrade_jdk11_python3.8_cythonno_x86_64_17_64 34 0 4
dtest-upgrade_jdk11_python3.8_cythonno_x86_64_18_64 32 0 6
dtest-upgrade_jdk11_python3.8_cythonno_x86_64_19_64 33 0 5
dtest-upgrade_jdk11_python3.8_cythonno_x86_64_1_64 34 0 5
dtest-upgrade_jdk11_python3.8_cythonno_x86_64_20_64 35 0 3
dtest-upgrade_jdk11_python3.8_cythonno_x86_64_21_64 34 0 4
dtest-upgrade_jdk11_python3.8_cythonno_x86_64_22_64 29 0 9
dtest-upgrade_jdk11_python3.8_cythonno_x86_64_23_64 32 0 6
dtest-upgrade_jdk11_python3.8_cythonno_x86_64_24_64 34 0 4
dtest-upgrade_jdk11_python3.8_cythonno_x86_64_25_64 34 0 4
dtest-upgrade_jdk11_python3.8_cythonno_x86_64_26_64 29 0 9
dtest-upgrade_jdk11_python3.8_cythonno_x86_64_27_64 33 0 5
dtest-upgrade_jdk11_python3.8_cythonno_x86_64_28_64 32 0 6
dtest-upgrade_jdk11_python3.8_cythonno_x86_64_29_64 33 0 5
dtest-upgrade_jdk11_python3.8_cythonno_x86_64_2_64 28 0 11
dtest-upgrade_jdk11_python3.8_cythonno_x86_64_30_64 33 0 5
dtest-upgrade_jdk11_python3.8_cythonno_x86_64_31_64 33 0 5
dtest-upgrade_jdk11_python3.8_cythonno_x86_64_32_64 29 0 9
dtest-upgrade_jdk11_python3.8_cythonno_x86_64_33_64 33 0 5
dtest-upgrade_jdk11_python3.8_cythonno_x86_64_34_64 35 0 3
dtest-upgrade_jdk11_python3.8_cythonno_x86_64_35_64 35 0 3
dtest-upgrade_jdk11_python3.8_cythonno_x86_64_36_64 30 0 8
dtest-upgrade_jdk11_python3.8_cythonno_x86_64_37_64 33 0 5
dtest-upgrade_jdk11_python3.8_cythonno_x86_64_38_64 34 0 4
dtest-upgrade_jdk11_python3.8_cythonno_x86_64_39_64 33 0 5
dtest-upgrade_jdk11_python3.8_cythonno_x86_64_3_64 30 0 8
dtest-upgrade_jdk11_python3.8_cythonno_x86_64_40_64 31 0 7
dtest-upgrade_jdk11_python3.8_cythonno_x86_64_41_64 34 0 4
dtest-upgrade_jdk11_python3.8_cythonno_x86_64_42_64 30 0 8
dtest-upgrade_jdk11_python3.8_cythonno_x86_64_43_64 32 0 6
dtest-upgrade_jdk11_python3.8_cythonno_x86_64_44_64 34 0 4
dtest-upgrade_jdk11_python3.8_cythonno_x86_64_45_64 34 0 4
dtest-upgrade_jdk11_python3.8_cythonno_x86_64_46_64 29 0 9
dtest-upgrade_jdk11_python3.8_cythonno_x86_64_47_64 32 0 6
dtest-upgrade_jdk11_python3.8_cythonno_x86_64_48_64 33 0 5
dtest-upgrade_jdk11_python3.8_cythonno_x86_64_49_64 32 0 6
dtest-upgrade_jdk11_python3.8_cythonno_x86_64_4_64 34 0 4
dtest-upgrade_jdk11_python3.8_cythonno_x86_64_50_64 31 0 7
dtest-upgrade_jdk11_python3.8_cythonno_x86_64_51_64 33 0 5
dtest-upgrade_jdk11_python3.8_cythonno_x86_64_52_64 30 0 8
dtest-upgrade_jdk11_python3.8_cythonno_x86_64_53_64 31 0 7
dtest-upgrade_jdk11_python3.8_cythonno_x86_64_54_64 33 0 5
dtest-upgrade_jdk11_python3.8_cythonno_x86_64_55_64 33 0 5
dtest-upgrade_jdk11_python3.8_cythonno_x86_64_56_64 28 0 10
dtest-upgrade_jdk11_python3.8_cythonno_x86_64_57_64 32 0 6
dtest-upgrade_jdk11_python3.8_cythonno_x86_64_58_64 32 0 6
dtest-upgrade_jdk11_python3.8_cythonno_x86_64_59_64 32 0 6
dtest-upgrade_jdk11_python3.8_cythonno_x86_64_5_64 34 0 4
dtest-upgrade_jdk11_python3.8_cythonno_x86_64_60_64 31 0 7
dtest-upgrade_jdk11_python3.8_cythonno_x86_64_61_64 32 0 6
dtest-upgrade_jdk11_python3.8_cythonno_x86_64_62_64 30 0 8
dtest-upgrade_jdk11_python3.8_cythonno_x86_64_63_64 32 0 6
dtest-upgrade_jdk11_python3.8_cythonno_x86_64_64_64 33 0 5
dtest-upgrade_jdk11_python3.8_cythonno_x86_64_6_64 30 0 8
dtest-upgrade_jdk11_python3.8_cythonno_x86_64_7_64 34 0 4
dtest-upgrade_jdk11_python3.8_cythonno_x86_64_8_64 32 0 6
dtest-upgrade_jdk11_python3.8_cythonno_x86_64_9_64 32 0 6
dtest_jdk11_python3.8_cythonno_x86_64_10_64 10 0 7
dtest_jdk11_python3.8_cythonno_x86_64_11_64 11 0 6
dtest_jdk11_python3.8_cythonno_x86_64_12_64 10 0 7
dtest_jdk11_python3.8_cythonno_x86_64_13_64 12 0 5
dtest_jdk11_python3.8_cythonno_x86_64_14_64 12 0 5
dtest_jdk11_python3.8_cythonno_x86_64_15_64 13 0 4
dtest_jdk11_python3.8_cythonno_x86_64_16_64 12 0 5
dtest_jdk11_python3.8_cythonno_x86_64_17_64 11 0 6
dtest_jdk11_python3.8_cythonno_x86_64_18_64 10 0 7
dtest_jdk11_python3.8_cythonno_x86_64_19_64 11 0 6
dtest_jdk11_python3.8_cythonno_x86_64_1_64 14 0 4
dtest_jdk11_python3.8_cythonno_x86_64_20_64 12 0 5
dtest_jdk11_python3.8_cythonno_x86_64_21_64 12 0 5
dtest_jdk11_python3.8_cythonno_x86_64_22_64 13 0 4
dtest_jdk11_python3.8_cythonno_x86_64_23_64 13 0 4
dtest_jdk11_python3.8_cythonno_x86_64_24_64 13 0 4
dtest_jdk11_python3.8_cythonno_x86_64_25_64 13 0 4
dtest_jdk11_python3.8_cythonno_x86_64_26_64 14 0 3
dtest_jdk11_python3.8_cythonno_x86_64_27_64 14 0 3
dtest_jdk11_python3.8_cythonno_x86_64_28_64 11 0 6
dtest_jdk11_python3.8_cythonno_x86_64_29_64 11 0 6
dtest_jdk11_python3.8_cythonno_x86_64_2_64 14 0 4
dtest_jdk11_python3.8_cythonno_x86_64_30_64 13 0 4
dtest_jdk11_python3.8_cythonno_x86_64_31_64 14 0 3
dtest_jdk11_python3.8_cythonno_x86_64_32_64 14 0 3
dtest_jdk11_python3.8_cythonno_x86_64_33_64 13 0 4
dtest_jdk11_python3.8_cythonno_x86_64_34_64 14 0 3
dtest_jdk11_python3.8_cythonno_x86_64_35_64 13 0 4
dtest_jdk11_python3.8_cythonno_x86_64_36_64 14 0 3
dtest_jdk11_python3.8_cythonno_x86_64_37_64 14 0 3
dtest_jdk11_python3.8_cythonno_x86_64_38_64 14 0 3
dtest_jdk11_python3.8_cythonno_x86_64_39_64 11 0 6
dtest_jdk11_python3.8_cythonno_x86_64_3_64 15 0 3
dtest_jdk11_python3.8_cythonno_x86_64_40_64 13 0 4
dtest_jdk11_python3.8_cythonno_x86_64_41_64 12 0 5
dtest_jdk11_python3.8_cythonno_x86_64_42_64 13 0 4
dtest_jdk11_python3.8_cythonno_x86_64_43_64 12 0 5
dtest_jdk11_python3.8_cythonno_x86_64_44_64 13 0 4
dtest_jdk11_python3.8_cythonno_x86_64_45_64 13 0 4
dtest_jdk11_python3.8_cythonno_x86_64_46_64 13 0 4
dtest_jdk11_python3.8_cythonno_x86_64_47_64 11 0 6
dtest_jdk11_python3.8_cythonno_x86_64_48_64 11 0 6
dtest_jdk11_python3.8_cythonno_x86_64_49_64 11 0 6
dtest_jdk11_python3.8_cythonno_x86_64_4_64 14 0 3
dtest_jdk11_python3.8_cythonno_x86_64_50_64 13 0 4
dtest_jdk11_python3.8_cythonno_x86_64_51_64 14 0 3
dtest_jdk11_python3.8_cythonno_x86_64_52_64 11 0 6
dtest_jdk11_python3.8_cythonno_x86_64_53_64 11 0 6
dtest_jdk11_python3.8_cythonno_x86_64_54_64 13 0 4
dtest_jdk11_python3.8_cythonno_x86_64_55_64 13 0 4
dtest_jdk11_python3.8_cythonno_x86_64_56_64 12 0 5
dtest_jdk11_python3.8_cythonno_x86_64_57_64 14 0 3
dtest_jdk11_python3.8_cythonno_x86_64_58_64 14 0 3
dtest_jdk11_python3.8_cythonno_x86_64_59_64 14 0 3
dtest_jdk11_python3.8_cythonno_x86_64_5_64 15 0 2
dtest_jdk11_python3.8_cythonno_x86_64_60_64 13 0 4
dtest_jdk11_python3.8_cythonno_x86_64_61_64 13 0 4
dtest_jdk11_python3.8_cythonno_x86_64_62_64 14 0 3
dtest_jdk11_python3.8_cythonno_x86_64_63_64 13 0 4
dtest_jdk11_python3.8_cythonno_x86_64_64_64 14 0 3
dtest_jdk11_python3.8_cythonno_x86_64_6_64 16 0 1
dtest_jdk11_python3.8_cythonno_x86_64_7_64 13 0 4
dtest_jdk11_python3.8_cythonno_x86_64_8_64 15 0 2
dtest_jdk11_python3.8_cythonno_x86_64_9_64 12 0 5
dtest_jdk17_python3.8_cythonno_x86_64_10_64 10 0 7
dtest_jdk17_python3.8_cythonno_x86_64_11_64 11 0 6
dtest_jdk17_python3.8_cythonno_x86_64_12_64 10 0 7
dtest_jdk17_python3.8_cythonno_x86_64_13_64 12 0 5
dtest_jdk17_python3.8_cythonno_x86_64_14_64 12 0 5
dtest_jdk17_python3.8_cythonno_x86_64_15_64 13 0 4
dtest_jdk17_python3.8_cythonno_x86_64_16_64 12 0 5
dtest_jdk17_python3.8_cythonno_x86_64_17_64 11 0 6
dtest_jdk17_python3.8_cythonno_x86_64_18_64 10 0 7
dtest_jdk17_python3.8_cythonno_x86_64_19_64 11 0 6
dtest_jdk17_python3.8_cythonno_x86_64_1_64 14 0 4
dtest_jdk17_python3.8_cythonno_x86_64_20_64 12 0 5
dtest_jdk17_python3.8_cythonno_x86_64_21_64 12 0 5
dtest_jdk17_python3.8_cythonno_x86_64_22_64 13 0 4
dtest_jdk17_python3.8_cythonno_x86_64_23_64 13 0 4
dtest_jdk17_python3.8_cythonno_x86_64_24_64 13 0 4
dtest_jdk17_python3.8_cythonno_x86_64_25_64 13 0 4
dtest_jdk17_python3.8_cythonno_x86_64_26_64 14 0 3
dtest_jdk17_python3.8_cythonno_x86_64_27_64 14 0 3
dtest_jdk17_python3.8_cythonno_x86_64_28_64 11 0 6
dtest_jdk17_python3.8_cythonno_x86_64_29_64 11 0 6
dtest_jdk17_python3.8_cythonno_x86_64_2_64 14 0 4
dtest_jdk17_python3.8_cythonno_x86_64_30_64 13 0 4
dtest_jdk17_python3.8_cythonno_x86_64_31_64 14 0 3
dtest_jdk17_python3.8_cythonno_x86_64_32_64 14 0 3
dtest_jdk17_python3.8_cythonno_x86_64_33_64 13 0 4
dtest_jdk17_python3.8_cythonno_x86_64_34_64 14 0 3
dtest_jdk17_python3.8_cythonno_x86_64_35_64 13 0 4
dtest_jdk17_python3.8_cythonno_x86_64_36_64 14 0 3
dtest_jdk17_python3.8_cythonno_x86_64_37_64 14 0 3
dtest_jdk17_python3.8_cythonno_x86_64_38_64 14 0 3
dtest_jdk17_python3.8_cythonno_x86_64_39_64 11 0 6
dtest_jdk17_python3.8_cythonno_x86_64_3_64 15 0 3
dtest_jdk17_python3.8_cythonno_x86_64_40_64 13 0 4
dtest_jdk17_python3.8_cythonno_x86_64_41_64 12 0 5
dtest_jdk17_python3.8_cythonno_x86_64_42_64 13 0 4
dtest_jdk17_python3.8_cythonno_x86_64_43_64 12 0 5
dtest_jdk17_python3.8_cythonno_x86_64_44_64 13 0 4
dtest_jdk17_python3.8_cythonno_x86_64_45_64 13 0 4
dtest_jdk17_python3.8_cythonno_x86_64_46_64 13 0 4
dtest_jdk17_python3.8_cythonno_x86_64_47_64 11 0 6
dtest_jdk17_python3.8_cythonno_x86_64_48_64 11 0 6
dtest_jdk17_python3.8_cythonno_x86_64_49_64 11 0 6
dtest_jdk17_python3.8_cythonno_x86_64_4_64 14 0 3
dtest_jdk17_python3.8_cythonno_x86_64_50_64 13 0 4
dtest_jdk17_python3.8_cythonno_x86_64_51_64 14 0 3
dtest_jdk17_python3.8_cythonno_x86_64_52_64 11 0 6
dtest_jdk17_python3.8_cythonno_x86_64_53_64 11 0 6
dtest_jdk17_python3.8_cythonno_x86_64_54_64 13 0 4
dtest_jdk17_python3.8_cythonno_x86_64_55_64 13 0 4
dtest_jdk17_python3.8_cythonno_x86_64_56_64 12 0 5
dtest_jdk17_python3.8_cythonno_x86_64_57_64 14 0 3
dtest_jdk17_python3.8_cythonno_x86_64_58_64 14 0 3
dtest_jdk17_python3.8_cythonno_x86_64_59_64 14 0 3
dtest_jdk17_python3.8_cythonno_x86_64_5_64 15 0 2
dtest_jdk17_python3.8_cythonno_x86_64_60_64 13 0 4
dtest_jdk17_python3.8_cythonno_x86_64_61_64 13 0 4
dtest_jdk17_python3.8_cythonno_x86_64_62_64 14 0 3
dtest_jdk17_python3.8_cythonno_x86_64_63_64 13 0 4
dtest_jdk17_python3.8_cythonno_x86_64_64_64 14 0 3
dtest_jdk17_python3.8_cythonno_x86_64_6_64 16 0 1
dtest_jdk17_python3.8_cythonno_x86_64_7_64 13 0 4
dtest_jdk17_python3.8_cythonno_x86_64_8_64 15 0 2
dtest_jdk17_python3.8_cythonno_x86_64_9_64 12 0 5
org.apache.cassandra.audit.AuditLogFilterTest-_jdk11_x86_64 11 0 0
org.apache.cassandra.audit.AuditLogFilterTest-_jdk17_x86_64 11 0 0
org.apache.cassandra.audit.AuditLogFilterTest-cdc_jdk11_x86_64 11 0 0
org.apache.cassandra.audit.AuditLogFilterTest-cdc_jdk17_x86_64 11 0 0
org.apache.cassandra.audit.AuditLogFilterTest-compression_jdk11_x86_64 11 0 0
org.apache.cassandra.audit.AuditLogFilterTest-compression_jdk17_x86_64 11 0 0
org.apache.cassandra.audit.AuditLogFilterTest-latest_jdk11_x86_64 11 0 0
org.apache.cassandra.audit.AuditLogFilterTest-latest_jdk17_x86_64 11 0 0
org.apache.cassandra.audit.AuditLogFilterTest-oa_jdk11_x86_64 11 0 0
org.apache.cassandra.audit.AuditLogFilterTest-oa_jdk17_x86_64 11 0 0
org.apache.cassandra.audit.AuditLogFilterTest-system_keyspace_directory_jdk11_x86_64 11 0 0
org.apache.cassandra.audit.AuditLogFilterTest-system_keyspace_directory_jdk17_x86_64 11 0 0
org.apache.cassandra.audit.AuditLogOptionsTest-_jdk11_x86_64 2 0 0
org.apache.cassandra.audit.AuditLogOptionsTest-_jdk17_x86_64 2 0 0
org.apache.cassandra.audit.AuditLogOptionsTest-cdc_jdk11_x86_64 2 0 0
org.apache.cassandra.audit.AuditLogOptionsTest-cdc_jdk17_x86_64 2 0 0
org.apache.cassandra.audit.AuditLogOptionsTest-compression_jdk11_x86_64 2 0 0
org.apache.cassandra.audit.AuditLogOptionsTest-compression_jdk17_x86_64 2 0 0
org.apache.cassandra.audit.AuditLogOptionsTest-latest_jdk11_x86_64 2 0 0
org.apache.cassandra.audit.AuditLogOptionsTest-latest_jdk17_x86_64 2 0 0
org.apache.cassandra.audit.AuditLogOptionsTest-oa_jdk11_x86_64 2 0 0
org.apache.cassandra.audit.AuditLogOptionsTest-oa_jdk17_x86_64 2 0 0
org.apache.cassandra.audit.AuditLogOptionsTest-system_keyspace_directory_jdk11_x86_64 2 0 0
org.apache.cassandra.audit.AuditLogOptionsTest-system_keyspace_directory_jdk17_x86_64 2 0 0
org.apache.cassandra.audit.AuditLoggerAuthTest-_jdk11_x86_64 15 0 0
org.apache.cassandra.audit.AuditLoggerAuthTest-_jdk17_x86_64 15 0 0
org.apache.cassandra.audit.AuditLoggerAuthTest-cdc_jdk11_x86_64 15 0 0
org.apache.cassandra.audit.AuditLoggerAuthTest-cdc_jdk17_x86_64 15 0 0
org.apache.cassandra.audit.AuditLoggerAuthTest-compression_jdk11_x86_64 15 0 0
org.apache.cassandra.audit.AuditLoggerAuthTest-compression_jdk17_x86_64 15 0 0
org.apache.cassandra.audit.AuditLoggerAuthTest-latest_jdk11_x86_64 15 0 0
org.apache.cassandra.audit.AuditLoggerAuthTest-latest_jdk17_x86_64 15 0 0
org.apache.cassandra.audit.AuditLoggerAuthTest-oa_jdk11_x86_64 15 0 0
org.apache.cassandra.audit.AuditLoggerAuthTest-oa_jdk17_x86_64 15 0 0
org.apache.cassandra.audit.AuditLoggerAuthTest-system_keyspace_directory_jdk11_x86_64 15 0 0
org.apache.cassandra.audit.AuditLoggerAuthTest-system_keyspace_directory_jdk17_x86_64 15 0 0
org.apache.cassandra.audit.AuditLoggerCleanupTest-_jdk11_x86_64 1 0 0
org.apache.cassandra.audit.AuditLoggerCleanupTest-_jdk17_x86_64 1 0 0
org.apache.cassandra.audit.AuditLoggerCleanupTest-cdc_jdk11_x86_64 1 0 0
org.apache.cassandra.audit.AuditLoggerCleanupTest-cdc_jdk17_x86_64 1 0 0
org.apache.cassandra.audit.AuditLoggerCleanupTest-compression_jdk11_x86_64 1 0 0
org.apache.cassandra.audit.AuditLoggerCleanupTest-compression_jdk17_x86_64 1 0 0
org.apache.cassandra.audit.AuditLoggerCleanupTest-latest_jdk11_x86_64 1 0 0
org.apache.cassandra.audit.AuditLoggerCleanupTest-latest_jdk17_x86_64 1 0 0
org.apache.cassandra.audit.AuditLoggerCleanupTest-oa_jdk11_x86_64 1 0 0
org.apache.cassandra.audit.AuditLoggerCleanupTest-oa_jdk17_x86_64 1 0 0
org.apache.cassandra.audit.AuditLoggerCleanupTest-system_keyspace_directory_jdk11_x86_64 1 0 0
org.apache.cassandra.audit.AuditLoggerCleanupTest-system_keyspace_directory_jdk17_x86_64 1 0 0
org.apache.cassandra.audit.AuditLoggerTest-_jdk11_x86_64 29 0 0
org.apache.cassandra.audit.AuditLoggerTest-_jdk17_x86_64 29 0 0
org.apache.cassandra.audit.AuditLoggerTest-cdc_jdk11_x86_64 29 0 0
org.apache.cassandra.audit.AuditLoggerTest-cdc_jdk17_x86_64 29 0 0
org.apache.cassandra.audit.AuditLoggerTest-compression_jdk11_x86_64 29 0 0
org.apache.cassandra.audit.AuditLoggerTest-compression_jdk17_x86_64 29 0 0
org.apache.cassandra.audit.AuditLoggerTest-latest_jdk11_x86_64 29 0 0
org.apache.cassandra.audit.AuditLoggerTest-latest_jdk17_x86_64 29 0 0
org.apache.cassandra.audit.AuditLoggerTest-oa_jdk11_x86_64 29 0 0
org.apache.cassandra.audit.AuditLoggerTest-oa_jdk17_x86_64 29 0 0
org.apache.cassandra.audit.AuditLoggerTest-system_keyspace_directory_jdk11_x86_64 29 0 0
org.apache.cassandra.audit.AuditLoggerTest-system_keyspace_directory_jdk17_x86_64 29 0 0
org.apache.cassandra.audit.BinAuditLoggerTest-_jdk11_x86_64 1 0 0
org.apache.cassandra.audit.BinAuditLoggerTest-_jdk17_x86_64 1 0 0
org.apache.cassandra.audit.BinAuditLoggerTest-cdc_jdk11_x86_64 1 0 0
org.apache.cassandra.audit.BinAuditLoggerTest-cdc_jdk17_x86_64 1 0 0
org.apache.cassandra.audit.BinAuditLoggerTest-compression_jdk11_x86_64 1 0 0
org.apache.cassandra.audit.BinAuditLoggerTest-compression_jdk17_x86_64 1 0 0
org.apache.cassandra.audit.BinAuditLoggerTest-latest_jdk11_x86_64 1 0 0
org.apache.cassandra.audit.BinAuditLoggerTest-latest_jdk17_x86_64 1 0 0
org.apache.cassandra.audit.BinAuditLoggerTest-oa_jdk11_x86_64 1 0 0
org.apache.cassandra.audit.BinAuditLoggerTest-oa_jdk17_x86_64 1 0 0
org.apache.cassandra.audit.BinAuditLoggerTest-system_keyspace_directory_jdk11_x86_64 1 0 0
org.apache.cassandra.audit.BinAuditLoggerTest-system_keyspace_directory_jdk17_x86_64 1 0 0
org.apache.cassandra.auth.AllowAllCIDRAuthorizerTest-_jdk11_x86_64 6 0 0
org.apache.cassandra.auth.AllowAllCIDRAuthorizerTest-_jdk17_x86_64 6 0 0
org.apache.cassandra.auth.AllowAllCIDRAuthorizerTest-cdc_jdk11_x86_64 6 0 0
org.apache.cassandra.auth.AllowAllCIDRAuthorizerTest-cdc_jdk17_x86_64 6 0 0
org.apache.cassandra.auth.AllowAllCIDRAuthorizerTest-compression_jdk11_x86_64 6 0 0
org.apache.cassandra.auth.AllowAllCIDRAuthorizerTest-compression_jdk17_x86_64 6 0 0
org.apache.cassandra.auth.AllowAllCIDRAuthorizerTest-latest_jdk11_x86_64 6 0 0
org.apache.cassandra.auth.AllowAllCIDRAuthorizerTest-latest_jdk17_x86_64 6 0 0
org.apache.cassandra.auth.AllowAllCIDRAuthorizerTest-oa_jdk11_x86_64 6 0 0
org.apache.cassandra.auth.AllowAllCIDRAuthorizerTest-oa_jdk17_x86_64 6 0 0
org.apache.cassandra.auth.AllowAllCIDRAuthorizerTest-system_keyspace_directory_jdk11_x86_64 6 0 0
org.apache.cassandra.auth.AllowAllCIDRAuthorizerTest-system_keyspace_directory_jdk17_x86_64 6 0 0
org.apache.cassandra.auth.AuthCacheTest-_jdk11_x86_64 25 0 0
org.apache.cassandra.auth.AuthCacheTest-_jdk17_x86_64 25 0 0
org.apache.cassandra.auth.AuthCacheTest-cdc_jdk11_x86_64 25 0 0
org.apache.cassandra.auth.AuthCacheTest-cdc_jdk17_x86_64 25 0 0
org.apache.cassandra.auth.AuthCacheTest-compression_jdk11_x86_64 25 0 0
org.apache.cassandra.auth.AuthCacheTest-compression_jdk17_x86_64 25 0 0
org.apache.cassandra.auth.AuthCacheTest-latest_jdk11_x86_64 25 0 0
org.apache.cassandra.auth.AuthCacheTest-latest_jdk17_x86_64 25 0 0
org.apache.cassandra.auth.AuthCacheTest-oa_jdk11_x86_64 25 0 0
org.apache.cassandra.auth.AuthCacheTest-oa_jdk17_x86_64 25 0 0
org.apache.cassandra.auth.AuthCacheTest-system_keyspace_directory_jdk11_x86_64 25 0 0
org.apache.cassandra.auth.AuthCacheTest-system_keyspace_directory_jdk17_x86_64 25 0 0
org.apache.cassandra.auth.AuthConfigTest-_jdk11_x86_64 3 0 0
org.apache.cassandra.auth.AuthConfigTest-_jdk17_x86_64 3 0 0
org.apache.cassandra.auth.AuthConfigTest-cdc_jdk11_x86_64 3 0 0
org.apache.cassandra.auth.AuthConfigTest-cdc_jdk17_x86_64 3 0 0
org.apache.cassandra.auth.AuthConfigTest-compression_jdk11_x86_64 3 0 0
org.apache.cassandra.auth.AuthConfigTest-compression_jdk17_x86_64 3 0 0
org.apache.cassandra.auth.AuthConfigTest-latest_jdk11_x86_64 3 0 0
org.apache.cassandra.auth.AuthConfigTest-latest_jdk17_x86_64 3 0 0
org.apache.cassandra.auth.AuthConfigTest-oa_jdk11_x86_64 3 0 0
org.apache.cassandra.auth.AuthConfigTest-oa_jdk17_x86_64 3 0 0
org.apache.cassandra.auth.AuthConfigTest-system_keyspace_directory_jdk11_x86_64 3 0 0
org.apache.cassandra.auth.AuthConfigTest-system_keyspace_directory_jdk17_x86_64 3 0 0
org.apache.cassandra.auth.AuthPropertiesTest-_jdk11_x86_64 2 0 0
org.apache.cassandra.auth.AuthPropertiesTest-_jdk17_x86_64 2 0 0
org.apache.cassandra.auth.AuthPropertiesTest-cdc_jdk11_x86_64 2 0 0
org.apache.cassandra.auth.AuthPropertiesTest-cdc_jdk17_x86_64 2 0 0
org.apache.cassandra.auth.AuthPropertiesTest-compression_jdk11_x86_64 2 0 0
org.apache.cassandra.auth.AuthPropertiesTest-compression_jdk17_x86_64 2 0 0
org.apache.cassandra.auth.AuthPropertiesTest-latest_jdk11_x86_64 2 0 0
org.apache.cassandra.auth.AuthPropertiesTest-latest_jdk17_x86_64 2 0 0
org.apache.cassandra.auth.AuthPropertiesTest-oa_jdk11_x86_64 2 0 0
org.apache.cassandra.auth.AuthPropertiesTest-oa_jdk17_x86_64 2 0 0
org.apache.cassandra.auth.AuthPropertiesTest-system_keyspace_directory_jdk11_x86_64 2 0 0
org.apache.cassandra.auth.AuthPropertiesTest-system_keyspace_directory_jdk17_x86_64 2 0 0
org.apache.cassandra.auth.CIDRGroupsMappingIntervalTreeTest-_jdk11_x86_64 8 0 0
org.apache.cassandra.auth.CIDRGroupsMappingIntervalTreeTest-_jdk17_x86_64 8 0 0
org.apache.cassandra.auth.CIDRGroupsMappingIntervalTreeTest-cdc_jdk11_x86_64 8 0 0
org.apache.cassandra.auth.CIDRGroupsMappingIntervalTreeTest-cdc_jdk17_x86_64 8 0 0
org.apache.cassandra.auth.CIDRGroupsMappingIntervalTreeTest-compression_jdk11_x86_64 8 0 0
org.apache.cassandra.auth.CIDRGroupsMappingIntervalTreeTest-compression_jdk17_x86_64 8 0 0
org.apache.cassandra.auth.CIDRGroupsMappingIntervalTreeTest-latest_jdk11_x86_64 8 0 0
org.apache.cassandra.auth.CIDRGroupsMappingIntervalTreeTest-latest_jdk17_x86_64 8 0 0
org.apache.cassandra.auth.CIDRGroupsMappingIntervalTreeTest-oa_jdk11_x86_64 8 0 0
org.apache.cassandra.auth.CIDRGroupsMappingIntervalTreeTest-oa_jdk17_x86_64 8 0 0
org.apache.cassandra.auth.CIDRGroupsMappingIntervalTreeTest-system_keyspace_directory_jdk11_x86_64 8 0 0
org.apache.cassandra.auth.CIDRGroupsMappingIntervalTreeTest-system_keyspace_directory_jdk17_x86_64 8 0 0
org.apache.cassandra.auth.CIDRGroupsMappingManagerTest-_jdk11_x86_64 7 0 0
org.apache.cassandra.auth.CIDRGroupsMappingManagerTest-_jdk17_x86_64 7 0 0
org.apache.cassandra.auth.CIDRGroupsMappingManagerTest-cdc_jdk11_x86_64 7 0 0
org.apache.cassandra.auth.CIDRGroupsMappingManagerTest-cdc_jdk17_x86_64 7 0 0
org.apache.cassandra.auth.CIDRGroupsMappingManagerTest-compression_jdk11_x86_64 7 0 0
org.apache.cassandra.auth.CIDRGroupsMappingManagerTest-compression_jdk17_x86_64 7 0 0
org.apache.cassandra.auth.CIDRGroupsMappingManagerTest-latest_jdk11_x86_64 7 0 0
org.apache.cassandra.auth.CIDRGroupsMappingManagerTest-latest_jdk17_x86_64 7 0 0
org.apache.cassandra.auth.CIDRGroupsMappingManagerTest-oa_jdk11_x86_64 7 0 0
org.apache.cassandra.auth.CIDRGroupsMappingManagerTest-oa_jdk17_x86_64 7 0 0
org.apache.cassandra.auth.CIDRGroupsMappingManagerTest-system_keyspace_directory_jdk11_x86_64 7 0 0
org.apache.cassandra.auth.CIDRGroupsMappingManagerTest-system_keyspace_directory_jdk17_x86_64 7 0 0
org.apache.cassandra.auth.CIDRGroupsMappingTableTest-_jdk11_x86_64 8 0 0
org.apache.cassandra.auth.CIDRGroupsMappingTableTest-_jdk17_x86_64 8 0 0
org.apache.cassandra.auth.CIDRGroupsMappingTableTest-cdc_jdk11_x86_64 8 0 0
org.apache.cassandra.auth.CIDRGroupsMappingTableTest-cdc_jdk17_x86_64 8 0 0
org.apache.cassandra.auth.CIDRGroupsMappingTableTest-compression_jdk11_x86_64 8 0 0
org.apache.cassandra.auth.CIDRGroupsMappingTableTest-compression_jdk17_x86_64 8 0 0
org.apache.cassandra.auth.CIDRGroupsMappingTableTest-latest_jdk11_x86_64 8 0 0
org.apache.cassandra.auth.CIDRGroupsMappingTableTest-latest_jdk17_x86_64 8 0 0
org.apache.cassandra.auth.CIDRGroupsMappingTableTest-oa_jdk11_x86_64 8 0 0
org.apache.cassandra.auth.CIDRGroupsMappingTableTest-oa_jdk17_x86_64 8 0 0
org.apache.cassandra.auth.CIDRGroupsMappingTableTest-system_keyspace_directory_jdk11_x86_64 8 0 0
org.apache.cassandra.auth.CIDRGroupsMappingTableTest-system_keyspace_directory_jdk17_x86_64 8 0 0
org.apache.cassandra.auth.CacheRefresherTest-_jdk11_x86_64 1 0 0
org.apache.cassandra.auth.CacheRefresherTest-_jdk17_x86_64 1 0 0
org.apache.cassandra.auth.CacheRefresherTest-cdc_jdk11_x86_64 1 0 0
org.apache.cassandra.auth.CacheRefresherTest-cdc_jdk17_x86_64 1 0 0
org.apache.cassandra.auth.CacheRefresherTest-compression_jdk11_x86_64 1 0 0
org.apache.cassandra.auth.CacheRefresherTest-compression_jdk17_x86_64 1 0 0
org.apache.cassandra.auth.CacheRefresherTest-latest_jdk11_x86_64 1 0 0
org.apache.cassandra.auth.CacheRefresherTest-latest_jdk17_x86_64 1 0 0
org.apache.cassandra.auth.CacheRefresherTest-oa_jdk11_x86_64 1 0 0
org.apache.cassandra.auth.CacheRefresherTest-oa_jdk17_x86_64 1 0 0
org.apache.cassandra.auth.CacheRefresherTest-system_keyspace_directory_jdk11_x86_64 1 0 0
org.apache.cassandra.auth.CacheRefresherTest-system_keyspace_directory_jdk17_x86_64 1 0 0
org.apache.cassandra.auth.CassandraAuthorizerTest-_jdk11_x86_64 1 0 0
org.apache.cassandra.auth.CassandraAuthorizerTest-_jdk17_x86_64 1 0 0
org.apache.cassandra.auth.CassandraAuthorizerTest-cdc_jdk11_x86_64 1 0 0
org.apache.cassandra.auth.CassandraAuthorizerTest-cdc_jdk17_x86_64 1 0 0
org.apache.cassandra.auth.CassandraAuthorizerTest-compression_jdk11_x86_64 1 0 0
org.apache.cassandra.auth.CassandraAuthorizerTest-compression_jdk17_x86_64 1 0 0
org.apache.cassandra.auth.CassandraAuthorizerTest-latest_jdk11_x86_64 1 0 0
org.apache.cassandra.auth.CassandraAuthorizerTest-latest_jdk17_x86_64 1 0 0
org.apache.cassandra.auth.CassandraAuthorizerTest-oa_jdk11_x86_64 1 0 0
org.apache.cassandra.auth.CassandraAuthorizerTest-oa_jdk17_x86_64 1 0 0
org.apache.cassandra.auth.CassandraAuthorizerTest-system_keyspace_directory_jdk11_x86_64 1 0 0
org.apache.cassandra.auth.CassandraAuthorizerTest-system_keyspace_directory_jdk17_x86_64 1 0 0
org.apache.cassandra.auth.CassandraAuthorizerTruncatingTest-_jdk11_x86_64 2 0 0
org.apache.cassandra.auth.CassandraAuthorizerTruncatingTest-_jdk17_x86_64 2 0 0
org.apache.cassandra.auth.CassandraAuthorizerTruncatingTest-cdc_jdk11_x86_64 2 0 0
org.apache.cassandra.auth.CassandraAuthorizerTruncatingTest-cdc_jdk17_x86_64 2 0 0
org.apache.cassandra.auth.CassandraAuthorizerTruncatingTest-compression_jdk11_x86_64 2 0 0
org.apache.cassandra.auth.CassandraAuthorizerTruncatingTest-compression_jdk17_x86_64 2 0 0
org.apache.cassandra.auth.CassandraAuthorizerTruncatingTest-latest_jdk11_x86_64 2 0 0
org.apache.cassandra.auth.CassandraAuthorizerTruncatingTest-latest_jdk17_x86_64 2 0 0
org.apache.cassandra.auth.CassandraAuthorizerTruncatingTest-oa_jdk11_x86_64 2 0 0
org.apache.cassandra.auth.CassandraAuthorizerTruncatingTest-oa_jdk17_x86_64 2 0 0
org.apache.cassandra.auth.CassandraAuthorizerTruncatingTest-system_keyspace_directory_jdk11_x86_64 2 0 0
org.apache.cassandra.auth.CassandraAuthorizerTruncatingTest-system_keyspace_directory_jdk17_x86_64 2 0 0
org.apache.cassandra.auth.CassandraCIDRAuthorizerEnforceModeTest-_jdk11_x86_64 10 0 0
org.apache.cassandra.auth.CassandraCIDRAuthorizerEnforceModeTest-_jdk17_x86_64 10 0 0
org.apache.cassandra.auth.CassandraCIDRAuthorizerEnforceModeTest-cdc_jdk11_x86_64 10 0 0
org.apache.cassandra.auth.CassandraCIDRAuthorizerEnforceModeTest-cdc_jdk17_x86_64 10 0 0
org.apache.cassandra.auth.CassandraCIDRAuthorizerEnforceModeTest-compression_jdk11_x86_64 10 0 0
org.apache.cassandra.auth.CassandraCIDRAuthorizerEnforceModeTest-compression_jdk17_x86_64 10 0 0
org.apache.cassandra.auth.CassandraCIDRAuthorizerEnforceModeTest-latest_jdk11_x86_64 10 0 0
org.apache.cassandra.auth.CassandraCIDRAuthorizerEnforceModeTest-latest_jdk17_x86_64 10 0 0
org.apache.cassandra.auth.CassandraCIDRAuthorizerEnforceModeTest-oa_jdk11_x86_64 10 0 0
org.apache.cassandra.auth.CassandraCIDRAuthorizerEnforceModeTest-oa_jdk17_x86_64 10 0 0
org.apache.cassandra.auth.CassandraCIDRAuthorizerEnforceModeTest-system_keyspace_directory_jdk11_x86_64 10 0 0
org.apache.cassandra.auth.CassandraCIDRAuthorizerEnforceModeTest-system_keyspace_directory_jdk17_x86_64 10 0 0
org.apache.cassandra.auth.CassandraCIDRAuthorizerMonitorModeTest-_jdk11_x86_64 3 0 0
org.apache.cassandra.auth.CassandraCIDRAuthorizerMonitorModeTest-_jdk17_x86_64 3 0 0
org.apache.cassandra.auth.CassandraCIDRAuthorizerMonitorModeTest-cdc_jdk11_x86_64 3 0 0
org.apache.cassandra.auth.CassandraCIDRAuthorizerMonitorModeTest-cdc_jdk17_x86_64 3 0 0
org.apache.cassandra.auth.CassandraCIDRAuthorizerMonitorModeTest-compression_jdk11_x86_64 3 0 0
org.apache.cassandra.auth.CassandraCIDRAuthorizerMonitorModeTest-compression_jdk17_x86_64 3 0 0
org.apache.cassandra.auth.CassandraCIDRAuthorizerMonitorModeTest-latest_jdk11_x86_64 3 0 0
org.apache.cassandra.auth.CassandraCIDRAuthorizerMonitorModeTest-latest_jdk17_x86_64 3 0 0
org.apache.cassandra.auth.CassandraCIDRAuthorizerMonitorModeTest-oa_jdk11_x86_64 3 0 0
org.apache.cassandra.auth.CassandraCIDRAuthorizerMonitorModeTest-oa_jdk17_x86_64 3 0 0
org.apache.cassandra.auth.CassandraCIDRAuthorizerMonitorModeTest-system_keyspace_directory_jdk11_x86_64 3 0 0
org.apache.cassandra.auth.CassandraCIDRAuthorizerMonitorModeTest-system_keyspace_directory_jdk17_x86_64 3 0 0
org.apache.cassandra.auth.CassandraNetworkAuthorizerTest-_jdk11_x86_64 6 0 0
org.apache.cassandra.auth.CassandraNetworkAuthorizerTest-_jdk17_x86_64 6 0 0
org.apache.cassandra.auth.CassandraNetworkAuthorizerTest-cdc_jdk11_x86_64 6 0 0
org.apache.cassandra.auth.CassandraNetworkAuthorizerTest-cdc_jdk17_x86_64 6 0 0
org.apache.cassandra.auth.CassandraNetworkAuthorizerTest-compression_jdk11_x86_64 6 0 0
org.apache.cassandra.auth.CassandraNetworkAuthorizerTest-compression_jdk17_x86_64 6 0 0
org.apache.cassandra.auth.CassandraNetworkAuthorizerTest-latest_jdk11_x86_64 6 0 0
org.apache.cassandra.auth.CassandraNetworkAuthorizerTest-latest_jdk17_x86_64 6 0 0
org.apache.cassandra.auth.CassandraNetworkAuthorizerTest-oa_jdk11_x86_64 6 0 0
org.apache.cassandra.auth.CassandraNetworkAuthorizerTest-oa_jdk17_x86_64 6 0 0
org.apache.cassandra.auth.CassandraNetworkAuthorizerTest-system_keyspace_directory_jdk11_x86_64 6 0 0
org.apache.cassandra.auth.CassandraNetworkAuthorizerTest-system_keyspace_directory_jdk17_x86_64 6 0 0
org.apache.cassandra.auth.CassandraRoleManagerTest-_jdk11_x86_64 4 0 0
org.apache.cassandra.auth.CassandraRoleManagerTest-_jdk17_x86_64 4 0 0
org.apache.cassandra.auth.CassandraRoleManagerTest-cdc_jdk11_x86_64 4 0 0
org.apache.cassandra.auth.CassandraRoleManagerTest-cdc_jdk17_x86_64 4 0 0
org.apache.cassandra.auth.CassandraRoleManagerTest-compression_jdk11_x86_64 4 0 0
org.apache.cassandra.auth.CassandraRoleManagerTest-compression_jdk17_x86_64 4 0 0
org.apache.cassandra.auth.CassandraRoleManagerTest-latest_jdk11_x86_64 4 0 0
org.apache.cassandra.auth.CassandraRoleManagerTest-latest_jdk17_x86_64 4 0 0
org.apache.cassandra.auth.CassandraRoleManagerTest-oa_jdk11_x86_64 4 0 0
org.apache.cassandra.auth.CassandraRoleManagerTest-oa_jdk17_x86_64 4 0 0
org.apache.cassandra.auth.CassandraRoleManagerTest-system_keyspace_directory_jdk11_x86_64 4 0 0
org.apache.cassandra.auth.CassandraRoleManagerTest-system_keyspace_directory_jdk17_x86_64 4 0 0
org.apache.cassandra.auth.CreateAndAlterRoleTest-_jdk11_x86_64 2 0 0
org.apache.cassandra.auth.CreateAndAlterRoleTest-_jdk17_x86_64 2 0 0
org.apache.cassandra.auth.CreateAndAlterRoleTest-cdc_jdk11_x86_64 2 0 0
org.apache.cassandra.auth.CreateAndAlterRoleTest-cdc_jdk17_x86_64 2 0 0
org.apache.cassandra.auth.CreateAndAlterRoleTest-compression_jdk11_x86_64 2 0 0
org.apache.cassandra.auth.CreateAndAlterRoleTest-compression_jdk17_x86_64 2 0 0
org.apache.cassandra.auth.CreateAndAlterRoleTest-latest_jdk11_x86_64 2 0 0
org.apache.cassandra.auth.CreateAndAlterRoleTest-latest_jdk17_x86_64 2 0 0
org.apache.cassandra.auth.CreateAndAlterRoleTest-oa_jdk11_x86_64 2 0 0
org.apache.cassandra.auth.CreateAndAlterRoleTest-oa_jdk17_x86_64 2 0 0
org.apache.cassandra.auth.CreateAndAlterRoleTest-system_keyspace_directory_jdk11_x86_64 2 0 0
org.apache.cassandra.auth.CreateAndAlterRoleTest-system_keyspace_directory_jdk17_x86_64 2 0 0
org.apache.cassandra.auth.FunctionResourceTest-_jdk11_x86_64 8 0 0
org.apache.cassandra.auth.FunctionResourceTest-_jdk17_x86_64 8 0 0
org.apache.cassandra.auth.FunctionResourceTest-cdc_jdk11_x86_64 8 0 0
org.apache.cassandra.auth.FunctionResourceTest-cdc_jdk17_x86_64 8 0 0
org.apache.cassandra.auth.FunctionResourceTest-compression_jdk11_x86_64 8 0 0
org.apache.cassandra.auth.FunctionResourceTest-compression_jdk17_x86_64 8 0 0
org.apache.cassandra.auth.FunctionResourceTest-latest_jdk11_x86_64 8 0 0
org.apache.cassandra.auth.FunctionResourceTest-latest_jdk17_x86_64 8 0 0
org.apache.cassandra.auth.FunctionResourceTest-oa_jdk11_x86_64 8 0 0
org.apache.cassandra.auth.FunctionResourceTest-oa_jdk17_x86_64 8 0 0
org.apache.cassandra.auth.FunctionResourceTest-system_keyspace_directory_jdk11_x86_64 8 0 0
org.apache.cassandra.auth.FunctionResourceTest-system_keyspace_directory_jdk17_x86_64 8 0 0
org.apache.cassandra.auth.GrantAndRevokeTest-_jdk11_x86_64 3 0 0
org.apache.cassandra.auth.GrantAndRevokeTest-_jdk17_x86_64 3 0 0
org.apache.cassandra.auth.GrantAndRevokeTest-cdc_jdk11_x86_64 3 0 0
org.apache.cassandra.auth.GrantAndRevokeTest-cdc_jdk17_x86_64 3 0 0
org.apache.cassandra.auth.GrantAndRevokeTest-compression_jdk11_x86_64 3 0 0
org.apache.cassandra.auth.GrantAndRevokeTest-compression_jdk17_x86_64 3 0 0
org.apache.cassandra.auth.GrantAndRevokeTest-latest_jdk11_x86_64 3 0 0
org.apache.cassandra.auth.GrantAndRevokeTest-latest_jdk17_x86_64 3 0 0
org.apache.cassandra.auth.GrantAndRevokeTest-oa_jdk11_x86_64 3 0 0
org.apache.cassandra.auth.GrantAndRevokeTest-oa_jdk17_x86_64 3 0 0
org.apache.cassandra.auth.GrantAndRevokeTest-system_keyspace_directory_jdk11_x86_64 3 0 0
org.apache.cassandra.auth.GrantAndRevokeTest-system_keyspace_directory_jdk17_x86_64 3 0 0
org.apache.cassandra.auth.MutualTlsAuthenticatorTest-_jdk11_x86_64 7 0 0
org.apache.cassandra.auth.MutualTlsAuthenticatorTest-_jdk17_x86_64 7 0 0
org.apache.cassandra.auth.MutualTlsAuthenticatorTest-cdc_jdk11_x86_64 7 0 0
org.apache.cassandra.auth.MutualTlsAuthenticatorTest-cdc_jdk17_x86_64 7 0 0
org.apache.cassandra.auth.MutualTlsAuthenticatorTest-compression_jdk11_x86_64 7 0 0
org.apache.cassandra.auth.MutualTlsAuthenticatorTest-compression_jdk17_x86_64 7 0 0
org.apache.cassandra.auth.MutualTlsAuthenticatorTest-latest_jdk11_x86_64 7 0 0
org.apache.cassandra.auth.MutualTlsAuthenticatorTest-latest_jdk17_x86_64 7 0 0
org.apache.cassandra.auth.MutualTlsAuthenticatorTest-oa_jdk11_x86_64 7 0 0
org.apache.cassandra.auth.MutualTlsAuthenticatorTest-oa_jdk17_x86_64 7 0 0
org.apache.cassandra.auth.MutualTlsAuthenticatorTest-system_keyspace_directory_jdk11_x86_64 7 0 0
org.apache.cassandra.auth.MutualTlsAuthenticatorTest-system_keyspace_directory_jdk17_x86_64 7 0 0
org.apache.cassandra.auth.MutualTlsCertificateValidityPeriodValidatorTest-_jdk11_x86_64 5 0 0
org.apache.cassandra.auth.MutualTlsCertificateValidityPeriodValidatorTest-_jdk17_x86_64 5 0 0
org.apache.cassandra.auth.MutualTlsCertificateValidityPeriodValidatorTest-cdc_jdk11_x86_64 5 0 0
org.apache.cassandra.auth.MutualTlsCertificateValidityPeriodValidatorTest-cdc_jdk17_x86_64 5 0 0
org.apache.cassandra.auth.MutualTlsCertificateValidityPeriodValidatorTest-compression_jdk11_x86_64 5 0 0
org.apache.cassandra.auth.MutualTlsCertificateValidityPeriodValidatorTest-compression_jdk17_x86_64 5 0 0
org.apache.cassandra.auth.MutualTlsCertificateValidityPeriodValidatorTest-latest_jdk11_x86_64 5 0 0
org.apache.cassandra.auth.MutualTlsCertificateValidityPeriodValidatorTest-latest_jdk17_x86_64 5 0 0
org.apache.cassandra.auth.MutualTlsCertificateValidityPeriodValidatorTest-oa_jdk11_x86_64 5 0 0
org.apache.cassandra.auth.MutualTlsCertificateValidityPeriodValidatorTest-oa_jdk17_x86_64 5 0 0
org.apache.cassandra.auth.MutualTlsCertificateValidityPeriodValidatorTest-system_keyspace_directory_jdk11_x86_64 5 0 0
org.apache.cassandra.auth.MutualTlsCertificateValidityPeriodValidatorTest-system_keyspace_directory_jdk17_x86_64 5 0 0
org.apache.cassandra.auth.MutualTlsInternodeAuthenticatorTest-_jdk11_x86_64 9 0 0
org.apache.cassandra.auth.MutualTlsInternodeAuthenticatorTest-_jdk17_x86_64 9 0 0
org.apache.cassandra.auth.MutualTlsInternodeAuthenticatorTest-cdc_jdk11_x86_64 9 0 0
org.apache.cassandra.auth.MutualTlsInternodeAuthenticatorTest-cdc_jdk17_x86_64 9 0 0
org.apache.cassandra.auth.MutualTlsInternodeAuthenticatorTest-compression_jdk11_x86_64 9 0 0
org.apache.cassandra.auth.MutualTlsInternodeAuthenticatorTest-compression_jdk17_x86_64 9 0 0
org.apache.cassandra.auth.MutualTlsInternodeAuthenticatorTest-latest_jdk11_x86_64 9 0 0
org.apache.cassandra.auth.MutualTlsInternodeAuthenticatorTest-latest_jdk17_x86_64 9 0 0
org.apache.cassandra.auth.MutualTlsInternodeAuthenticatorTest-oa_jdk11_x86_64 9 0 0
org.apache.cassandra.auth.MutualTlsInternodeAuthenticatorTest-oa_jdk17_x86_64 9 0 0
org.apache.cassandra.auth.MutualTlsInternodeAuthenticatorTest-system_keyspace_directory_jdk11_x86_64 9 0 0
org.apache.cassandra.auth.MutualTlsInternodeAuthenticatorTest-system_keyspace_directory_jdk17_x86_64 9 0 0
org.apache.cassandra.auth.MutualTlsUtilTest-_jdk11_x86_64 1 0 0
org.apache.cassandra.auth.MutualTlsUtilTest-_jdk17_x86_64 1 0 0
org.apache.cassandra.auth.MutualTlsUtilTest-cdc_jdk11_x86_64 1 0 0
org.apache.cassandra.auth.MutualTlsUtilTest-cdc_jdk17_x86_64 1 0 0
org.apache.cassandra.auth.MutualTlsUtilTest-compression_jdk11_x86_64 1 0 0
org.apache.cassandra.auth.MutualTlsUtilTest-compression_jdk17_x86_64 1 0 0
org.apache.cassandra.auth.MutualTlsUtilTest-latest_jdk11_x86_64 1 0 0
org.apache.cassandra.auth.MutualTlsUtilTest-latest_jdk17_x86_64 1 0 0
org.apache.cassandra.auth.MutualTlsUtilTest-oa_jdk11_x86_64 1 0 0
org.apache.cassandra.auth.MutualTlsUtilTest-oa_jdk17_x86_64 1 0 0
org.apache.cassandra.auth.MutualTlsUtilTest-system_keyspace_directory_jdk11_x86_64 1 0 0
org.apache.cassandra.auth.MutualTlsUtilTest-system_keyspace_directory_jdk17_x86_64 1 0 0
org.apache.cassandra.auth.MutualTlsWithPasswordFallbackAuthenticatorTest-_jdk11_x86_64 3 0 0
org.apache.cassandra.auth.MutualTlsWithPasswordFallbackAuthenticatorTest-_jdk17_x86_64 3 0 0
org.apache.cassandra.auth.MutualTlsWithPasswordFallbackAuthenticatorTest-cdc_jdk11_x86_64 3 0 0
org.apache.cassandra.auth.MutualTlsWithPasswordFallbackAuthenticatorTest-cdc_jdk17_x86_64 3 0 0
org.apache.cassandra.auth.MutualTlsWithPasswordFallbackAuthenticatorTest-compression_jdk11_x86_64 3 0 0
org.apache.cassandra.auth.MutualTlsWithPasswordFallbackAuthenticatorTest-compression_jdk17_x86_64 3 0 0
org.apache.cassandra.auth.MutualTlsWithPasswordFallbackAuthenticatorTest-latest_jdk11_x86_64 3 0 0
org.apache.cassandra.auth.MutualTlsWithPasswordFallbackAuthenticatorTest-latest_jdk17_x86_64 3 0 0
org.apache.cassandra.auth.MutualTlsWithPasswordFallbackAuthenticatorTest-oa_jdk11_x86_64 3 0 0
org.apache.cassandra.auth.MutualTlsWithPasswordFallbackAuthenticatorTest-oa_jdk17_x86_64 3 0 0
org.apache.cassandra.auth.MutualTlsWithPasswordFallbackAuthenticatorTest-system_keyspace_directory_jdk11_x86_64 3 0 0
org.apache.cassandra.auth.MutualTlsWithPasswordFallbackAuthenticatorTest-system_keyspace_directory_jdk17_x86_64 3 0 0
org.apache.cassandra.auth.PasswordAuthenticatorTest-_jdk11_x86_64 11 0 0
org.apache.cassandra.auth.PasswordAuthenticatorTest-_jdk17_x86_64 11 0 0
org.apache.cassandra.auth.PasswordAuthenticatorTest-cdc_jdk11_x86_64 11 0 0
org.apache.cassandra.auth.PasswordAuthenticatorTest-cdc_jdk17_x86_64 11 0 0
org.apache.cassandra.auth.PasswordAuthenticatorTest-compression_jdk11_x86_64 11 0 0
org.apache.cassandra.auth.PasswordAuthenticatorTest-compression_jdk17_x86_64 11 0 0
org.apache.cassandra.auth.PasswordAuthenticatorTest-latest_jdk11_x86_64 11 0 0
org.apache.cassandra.auth.PasswordAuthenticatorTest-latest_jdk17_x86_64 11 0 0
org.apache.cassandra.auth.PasswordAuthenticatorTest-oa_jdk11_x86_64 11 0 0
org.apache.cassandra.auth.PasswordAuthenticatorTest-oa_jdk17_x86_64 11 0 0
org.apache.cassandra.auth.PasswordAuthenticatorTest-system_keyspace_directory_jdk11_x86_64 11 0 0
org.apache.cassandra.auth.PasswordAuthenticatorTest-system_keyspace_directory_jdk17_x86_64 11 0 0
org.apache.cassandra.auth.ResourcesTest-_jdk11_x86_64 4 0 0
org.apache.cassandra.auth.ResourcesTest-_jdk17_x86_64 4 0 0
org.apache.cassandra.auth.ResourcesTest-cdc_jdk11_x86_64 4 0 0
org.apache.cassandra.auth.ResourcesTest-cdc_jdk17_x86_64 4 0 0
org.apache.cassandra.auth.ResourcesTest-compression_jdk11_x86_64 4 0 0
org.apache.cassandra.auth.ResourcesTest-compression_jdk17_x86_64 4 0 0
org.apache.cassandra.auth.ResourcesTest-latest_jdk11_x86_64 4 0 0
org.apache.cassandra.auth.ResourcesTest-latest_jdk17_x86_64 4 0 0
org.apache.cassandra.auth.ResourcesTest-oa_jdk11_x86_64 4 0 0
org.apache.cassandra.auth.ResourcesTest-oa_jdk17_x86_64 4 0 0
org.apache.cassandra.auth.ResourcesTest-system_keyspace_directory_jdk11_x86_64 4 0 0
org.apache.cassandra.auth.ResourcesTest-system_keyspace_directory_jdk17_x86_64 4 0 0
org.apache.cassandra.auth.RoleOptionsTest-_jdk11_x86_64 4 0 0
org.apache.cassandra.auth.RoleOptionsTest-_jdk17_x86_64 4 0 0
org.apache.cassandra.auth.RoleOptionsTest-cdc_jdk11_x86_64 4 0 0
org.apache.cassandra.auth.RoleOptionsTest-cdc_jdk17_x86_64 4 0 0
org.apache.cassandra.auth.RoleOptionsTest-compression_jdk11_x86_64 4 0 0
org.apache.cassandra.auth.RoleOptionsTest-compression_jdk17_x86_64 4 0 0
org.apache.cassandra.auth.RoleOptionsTest-latest_jdk11_x86_64 4 0 0
org.apache.cassandra.auth.RoleOptionsTest-latest_jdk17_x86_64 4 0 0
org.apache.cassandra.auth.RoleOptionsTest-oa_jdk11_x86_64 4 0 0
org.apache.cassandra.auth.RoleOptionsTest-oa_jdk17_x86_64 4 0 0
org.apache.cassandra.auth.RoleOptionsTest-system_keyspace_directory_jdk11_x86_64 4 0 0
org.apache.cassandra.auth.RoleOptionsTest-system_keyspace_directory_jdk17_x86_64 4 0 0
org.apache.cassandra.auth.RolesTest-_jdk11_x86_64 6 0 0
org.apache.cassandra.auth.RolesTest-_jdk17_x86_64 6 0 0
org.apache.cassandra.auth.RolesTest-cdc_jdk11_x86_64 6 0 0
org.apache.cassandra.auth.RolesTest-cdc_jdk17_x86_64 6 0 0
org.apache.cassandra.auth.RolesTest-compression_jdk11_x86_64 6 0 0
org.apache.cassandra.auth.RolesTest-compression_jdk17_x86_64 6 0 0
org.apache.cassandra.auth.RolesTest-latest_jdk11_x86_64 6 0 0
org.apache.cassandra.auth.RolesTest-latest_jdk17_x86_64 6 0 0
org.apache.cassandra.auth.RolesTest-oa_jdk11_x86_64 6 0 0
org.apache.cassandra.auth.RolesTest-oa_jdk17_x86_64 6 0 0
org.apache.cassandra.auth.RolesTest-system_keyspace_directory_jdk11_x86_64 6 0 0
org.apache.cassandra.auth.RolesTest-system_keyspace_directory_jdk17_x86_64 6 0 0
org.apache.cassandra.auth.SpiffeCertificateValidatorTest-_jdk11_x86_64 2 0 0
org.apache.cassandra.auth.SpiffeCertificateValidatorTest-_jdk17_x86_64 2 0 0
org.apache.cassandra.auth.SpiffeCertificateValidatorTest-cdc_jdk11_x86_64 2 0 0
org.apache.cassandra.auth.SpiffeCertificateValidatorTest-cdc_jdk17_x86_64 2 0 0
org.apache.cassandra.auth.SpiffeCertificateValidatorTest-compression_jdk11_x86_64 2 0 0
org.apache.cassandra.auth.SpiffeCertificateValidatorTest-compression_jdk17_x86_64 2 0 0
org.apache.cassandra.auth.SpiffeCertificateValidatorTest-latest_jdk11_x86_64 2 0 0
org.apache.cassandra.auth.SpiffeCertificateValidatorTest-latest_jdk17_x86_64 2 0 0
org.apache.cassandra.auth.SpiffeCertificateValidatorTest-oa_jdk11_x86_64 2 0 0
org.apache.cassandra.auth.SpiffeCertificateValidatorTest-oa_jdk17_x86_64 2 0 0
org.apache.cassandra.auth.SpiffeCertificateValidatorTest-system_keyspace_directory_jdk11_x86_64 2 0 0
org.apache.cassandra.auth.SpiffeCertificateValidatorTest-system_keyspace_directory_jdk17_x86_64 2 0 0
org.apache.cassandra.auth.jmx.AuthorizationProxyTest-_jdk11_x86_64 20 0 0
org.apache.cassandra.auth.jmx.AuthorizationProxyTest-_jdk17_x86_64 20 0 0
org.apache.cassandra.auth.jmx.AuthorizationProxyTest-cdc_jdk11_x86_64 20 0 0
org.apache.cassandra.auth.jmx.AuthorizationProxyTest-cdc_jdk17_x86_64 20 0 0
org.apache.cassandra.auth.jmx.AuthorizationProxyTest-compression_jdk11_x86_64 20 0 0
org.apache.cassandra.auth.jmx.AuthorizationProxyTest-compression_jdk17_x86_64 20 0 0
org.apache.cassandra.auth.jmx.AuthorizationProxyTest-latest_jdk11_x86_64 20 0 0
org.apache.cassandra.auth.jmx.AuthorizationProxyTest-latest_jdk17_x86_64 20 0 0
org.apache.cassandra.auth.jmx.AuthorizationProxyTest-oa_jdk11_x86_64 20 0 0
org.apache.cassandra.auth.jmx.AuthorizationProxyTest-oa_jdk17_x86_64 20 0 0
org.apache.cassandra.auth.jmx.AuthorizationProxyTest-system_keyspace_directory_jdk11_x86_64 20 0 0
org.apache.cassandra.auth.jmx.AuthorizationProxyTest-system_keyspace_directory_jdk17_x86_64 20 0 0
org.apache.cassandra.auth.jmx.JMXAuthTest-_jdk11_x86_64 3 0 0
org.apache.cassandra.auth.jmx.JMXAuthTest-_jdk17_x86_64 3 0 0
org.apache.cassandra.auth.jmx.JMXAuthTest-cdc_jdk11_x86_64 3 0 0
org.apache.cassandra.auth.jmx.JMXAuthTest-cdc_jdk17_x86_64 3 0 0
org.apache.cassandra.auth.jmx.JMXAuthTest-compression_jdk11_x86_64 3 0 0
org.apache.cassandra.auth.jmx.JMXAuthTest-compression_jdk17_x86_64 3 0 0
org.apache.cassandra.auth.jmx.JMXAuthTest-latest_jdk11_x86_64 3 0 0
org.apache.cassandra.auth.jmx.JMXAuthTest-latest_jdk17_x86_64 3 0 0
org.apache.cassandra.auth.jmx.JMXAuthTest-oa_jdk11_x86_64 3 0 0
org.apache.cassandra.auth.jmx.JMXAuthTest-oa_jdk17_x86_64 3 0 0
org.apache.cassandra.auth.jmx.JMXAuthTest-system_keyspace_directory_jdk11_x86_64 3 0 0
org.apache.cassandra.auth.jmx.JMXAuthTest-system_keyspace_directory_jdk17_x86_64 3 0 0
org.apache.cassandra.batchlog.BatchlogEndpointFilterTest-_jdk11_x86_64 7 0 0
org.apache.cassandra.batchlog.BatchlogEndpointFilterTest-_jdk17_x86_64 7 0 0
org.apache.cassandra.batchlog.BatchlogEndpointFilterTest-cdc_jdk11_x86_64 7 0 0
org.apache.cassandra.batchlog.BatchlogEndpointFilterTest-cdc_jdk17_x86_64 7 0 0
org.apache.cassandra.batchlog.BatchlogEndpointFilterTest-compression_jdk11_x86_64 7 0 0
org.apache.cassandra.batchlog.BatchlogEndpointFilterTest-compression_jdk17_x86_64 7 0 0
org.apache.cassandra.batchlog.BatchlogEndpointFilterTest-latest_jdk11_x86_64 7 0 0
org.apache.cassandra.batchlog.BatchlogEndpointFilterTest-latest_jdk17_x86_64 7 0 0
org.apache.cassandra.batchlog.BatchlogEndpointFilterTest-oa_jdk11_x86_64 7 0 0
org.apache.cassandra.batchlog.BatchlogEndpointFilterTest-oa_jdk17_x86_64 7 0 0
org.apache.cassandra.batchlog.BatchlogEndpointFilterTest-system_keyspace_directory_jdk11_x86_64 7 0 0
org.apache.cassandra.batchlog.BatchlogEndpointFilterTest-system_keyspace_directory_jdk17_x86_64 7 0 0
org.apache.cassandra.batchlog.BatchlogManagerTest-_jdk11_x86_64 6 0 0
org.apache.cassandra.batchlog.BatchlogManagerTest-_jdk17_x86_64 6 0 0
org.apache.cassandra.batchlog.BatchlogManagerTest-cdc_jdk11_x86_64 6 0 0
org.apache.cassandra.batchlog.BatchlogManagerTest-cdc_jdk17_x86_64 6 0 0
org.apache.cassandra.batchlog.BatchlogManagerTest-compression_jdk11_x86_64 6 0 0
org.apache.cassandra.batchlog.BatchlogManagerTest-compression_jdk17_x86_64 6 0 0
org.apache.cassandra.batchlog.BatchlogManagerTest-latest_jdk11_x86_64 6 0 0
org.apache.cassandra.batchlog.BatchlogManagerTest-latest_jdk17_x86_64 6 0 0
org.apache.cassandra.batchlog.BatchlogManagerTest-oa_jdk11_x86_64 6 0 0
org.apache.cassandra.batchlog.BatchlogManagerTest-oa_jdk17_x86_64 6 0 0
org.apache.cassandra.batchlog.BatchlogManagerTest-system_keyspace_directory_jdk11_x86_64 6 0 0
org.apache.cassandra.batchlog.BatchlogManagerTest-system_keyspace_directory_jdk17_x86_64 6 0 0
org.apache.cassandra.batchlog.BatchlogTest-_jdk11_x86_64 1 0 0
org.apache.cassandra.batchlog.BatchlogTest-_jdk17_x86_64 1 0 0
org.apache.cassandra.batchlog.BatchlogTest-cdc_jdk11_x86_64 1 0 0
org.apache.cassandra.batchlog.BatchlogTest-cdc_jdk17_x86_64 1 0 0
org.apache.cassandra.batchlog.BatchlogTest-compression_jdk11_x86_64 1 0 0
org.apache.cassandra.batchlog.BatchlogTest-compression_jdk17_x86_64 1 0 0
org.apache.cassandra.batchlog.BatchlogTest-latest_jdk11_x86_64 1 0 0
org.apache.cassandra.batchlog.BatchlogTest-latest_jdk17_x86_64 1 0 0
org.apache.cassandra.batchlog.BatchlogTest-oa_jdk11_x86_64 1 0 0
org.apache.cassandra.batchlog.BatchlogTest-oa_jdk17_x86_64 1 0 0
org.apache.cassandra.batchlog.BatchlogTest-system_keyspace_directory_jdk11_x86_64 1 0 0
org.apache.cassandra.batchlog.BatchlogTest-system_keyspace_directory_jdk17_x86_64 1 0 0
org.apache.cassandra.cache.AutoSavingCacheTest-_jdk11_x86_64 2 0 0
org.apache.cassandra.cache.AutoSavingCacheTest-_jdk17_x86_64 2 0 0
org.apache.cassandra.cache.AutoSavingCacheTest-cdc_jdk11_x86_64 2 0 0
org.apache.cassandra.cache.AutoSavingCacheTest-cdc_jdk17_x86_64 2 0 0
org.apache.cassandra.cache.AutoSavingCacheTest-compression_jdk11_x86_64 2 0 0
org.apache.cassandra.cache.AutoSavingCacheTest-compression_jdk17_x86_64 2 0 0
org.apache.cassandra.cache.AutoSavingCacheTest-latest_jdk11_x86_64 0 0 1
org.apache.cassandra.cache.AutoSavingCacheTest-latest_jdk17_x86_64 0 0 1
org.apache.cassandra.cache.AutoSavingCacheTest-oa_jdk11_x86_64 2 0 0
org.apache.cassandra.cache.AutoSavingCacheTest-oa_jdk17_x86_64 2 0 0
org.apache.cassandra.cache.AutoSavingCacheTest-system_keyspace_directory_jdk11_x86_64 2 0 0
org.apache.cassandra.cache.AutoSavingCacheTest-system_keyspace_directory_jdk17_x86_64 2 0 0
org.apache.cassandra.cache.CacheProviderTest-_jdk11_x86_64 2 0 0
org.apache.cassandra.cache.CacheProviderTest-_jdk17_x86_64 2 0 0
org.apache.cassandra.cache.CacheProviderTest-cdc_jdk11_x86_64 2 0 0
org.apache.cassandra.cache.CacheProviderTest-cdc_jdk17_x86_64 2 0 0
org.apache.cassandra.cache.CacheProviderTest-compression_jdk11_x86_64 2 0 0
org.apache.cassandra.cache.CacheProviderTest-compression_jdk17_x86_64 2 0 0
org.apache.cassandra.cache.CacheProviderTest-latest_jdk11_x86_64 2 0 0
org.apache.cassandra.cache.CacheProviderTest-latest_jdk17_x86_64 2 0 0
org.apache.cassandra.cache.CacheProviderTest-oa_jdk11_x86_64 2 0 0
org.apache.cassandra.cache.CacheProviderTest-oa_jdk17_x86_64 2 0 0
org.apache.cassandra.cache.CacheProviderTest-system_keyspace_directory_jdk11_x86_64 2 0 0
org.apache.cassandra.cache.CacheProviderTest-system_keyspace_directory_jdk17_x86_64 2 0 0
org.apache.cassandra.cache.NopCacheProviderTest-_jdk11_x86_64 2 0 0
org.apache.cassandra.cache.NopCacheProviderTest-_jdk17_x86_64 2 0 0
org.apache.cassandra.cache.NopCacheProviderTest-cdc_jdk11_x86_64 2 0 0
org.apache.cassandra.cache.NopCacheProviderTest-cdc_jdk17_x86_64 2 0 0
org.apache.cassandra.cache.NopCacheProviderTest-compression_jdk11_x86_64 2 0 0
org.apache.cassandra.cache.NopCacheProviderTest-compression_jdk17_x86_64 2 0 0
org.apache.cassandra.cache.NopCacheProviderTest-latest_jdk11_x86_64 2 0 0
org.apache.cassandra.cache.NopCacheProviderTest-latest_jdk17_x86_64 2 0 0
org.apache.cassandra.cache.NopCacheProviderTest-oa_jdk11_x86_64 2 0 0
org.apache.cassandra.cache.NopCacheProviderTest-oa_jdk17_x86_64 2 0 0
org.apache.cassandra.cache.NopCacheProviderTest-system_keyspace_directory_jdk11_x86_64 2 0 0
org.apache.cassandra.cache.NopCacheProviderTest-system_keyspace_directory_jdk17_x86_64 2 0 0
org.apache.cassandra.concurrent.AbstractExecutorPlusTest-_jdk11_x86_64 0 0 1
org.apache.cassandra.concurrent.AbstractExecutorPlusTest-_jdk17_x86_64 0 0 1
org.apache.cassandra.concurrent.AbstractExecutorPlusTest-cdc_jdk11_x86_64 0 0 1
org.apache.cassandra.concurrent.AbstractExecutorPlusTest-cdc_jdk17_x86_64 0 0 1
org.apache.cassandra.concurrent.AbstractExecutorPlusTest-compression_jdk11_x86_64 0 0 1
org.apache.cassandra.concurrent.AbstractExecutorPlusTest-compression_jdk17_x86_64 0 0 1
org.apache.cassandra.concurrent.AbstractExecutorPlusTest-latest_jdk11_x86_64 0 0 1
org.apache.cassandra.concurrent.AbstractExecutorPlusTest-latest_jdk17_x86_64 0 0 1
org.apache.cassandra.concurrent.AbstractExecutorPlusTest-oa_jdk11_x86_64 0 0 1
org.apache.cassandra.concurrent.AbstractExecutorPlusTest-oa_jdk17_x86_64 0 0 1
org.apache.cassandra.concurrent.AbstractExecutorPlusTest-system_keyspace_directory_jdk11_x86_64 0 0 1
org.apache.cassandra.concurrent.AbstractExecutorPlusTest-system_keyspace_directory_jdk17_x86_64 0 0 1
org.apache.cassandra.concurrent.DebuggableScheduledThreadPoolExecutorTest-_jdk11_x86_64 1 0 0
org.apache.cassandra.concurrent.DebuggableScheduledThreadPoolExecutorTest-_jdk17_x86_64 1 0 0
org.apache.cassandra.concurrent.DebuggableScheduledThreadPoolExecutorTest-cdc_jdk11_x86_64 1 0 0
org.apache.cassandra.concurrent.DebuggableScheduledThreadPoolExecutorTest-cdc_jdk17_x86_64 1 0 0
org.apache.cassandra.concurrent.DebuggableScheduledThreadPoolExecutorTest-compression_jdk11_x86_64 1 0 0
org.apache.cassandra.concurrent.DebuggableScheduledThreadPoolExecutorTest-compression_jdk17_x86_64 1 0 0
org.apache.cassandra.concurrent.DebuggableScheduledThreadPoolExecutorTest-latest_jdk11_x86_64 1 0 0
org.apache.cassandra.concurrent.DebuggableScheduledThreadPoolExecutorTest-latest_jdk17_x86_64 1 0 0
org.apache.cassandra.concurrent.DebuggableScheduledThreadPoolExecutorTest-oa_jdk11_x86_64 1 0 0
org.apache.cassandra.concurrent.DebuggableScheduledThreadPoolExecutorTest-oa_jdk17_x86_64 1 0 0
org.apache.cassandra.concurrent.DebuggableScheduledThreadPoolExecutorTest-system_keyspace_directory_jdk11_x86_64 1 0 0
org.apache.cassandra.concurrent.DebuggableScheduledThreadPoolExecutorTest-system_keyspace_directory_jdk17_x86_64 1 0 0
org.apache.cassandra.concurrent.DebuggableThreadPoolExecutorTest-_jdk11_x86_64 6 0 0
org.apache.cassandra.concurrent.DebuggableThreadPoolExecutorTest-_jdk17_x86_64 6 0 0
org.apache.cassandra.concurrent.DebuggableThreadPoolExecutorTest-cdc_jdk11_x86_64 6 0 0
org.apache.cassandra.concurrent.DebuggableThreadPoolExecutorTest-cdc_jdk17_x86_64 6 0 0
org.apache.cassandra.concurrent.DebuggableThreadPoolExecutorTest-compression_jdk11_x86_64 6 0 0
org.apache.cassandra.concurrent.DebuggableThreadPoolExecutorTest-compression_jdk17_x86_64 6 0 0
org.apache.cassandra.concurrent.DebuggableThreadPoolExecutorTest-latest_jdk11_x86_64 6 0 0
org.apache.cassandra.concurrent.DebuggableThreadPoolExecutorTest-latest_jdk17_x86_64 6 0 0
org.apache.cassandra.concurrent.DebuggableThreadPoolExecutorTest-oa_jdk11_x86_64 6 0 0
org.apache.cassandra.concurrent.DebuggableThreadPoolExecutorTest-oa_jdk17_x86_64 6 0 0
org.apache.cassandra.concurrent.DebuggableThreadPoolExecutorTest-system_keyspace_directory_jdk11_x86_64 6 0 0
org.apache.cassandra.concurrent.DebuggableThreadPoolExecutorTest-system_keyspace_directory_jdk17_x86_64 6 0 0
org.apache.cassandra.concurrent.ExecutorPlusTest-_jdk11_x86_64 2 0 0
org.apache.cassandra.concurrent.ExecutorPlusTest-_jdk17_x86_64 2 0 0
org.apache.cassandra.concurrent.ExecutorPlusTest-cdc_jdk11_x86_64 2 0 0
org.apache.cassandra.concurrent.ExecutorPlusTest-cdc_jdk17_x86_64 2 0 0
org.apache.cassandra.concurrent.ExecutorPlusTest-compression_jdk11_x86_64 2 0 0
org.apache.cassandra.concurrent.ExecutorPlusTest-compression_jdk17_x86_64 2 0 0
org.apache.cassandra.concurrent.ExecutorPlusTest-latest_jdk11_x86_64 2 0 0
org.apache.cassandra.concurrent.ExecutorPlusTest-latest_jdk17_x86_64 2 0 0
org.apache.cassandra.concurrent.ExecutorPlusTest-oa_jdk11_x86_64 2 0 0
org.apache.cassandra.concurrent.ExecutorPlusTest-oa_jdk17_x86_64 2 0 0
org.apache.cassandra.concurrent.ExecutorPlusTest-system_keyspace_directory_jdk11_x86_64 2 0 0
org.apache.cassandra.concurrent.ExecutorPlusTest-system_keyspace_directory_jdk17_x86_64 2 0 0
org.apache.cassandra.concurrent.InfiniteLoopExecutorTest-_jdk11_x86_64 2 0 0
org.apache.cassandra.concurrent.InfiniteLoopExecutorTest-_jdk17_x86_64 2 0 0
org.apache.cassandra.concurrent.InfiniteLoopExecutorTest-cdc_jdk11_x86_64 2 0 0
org.apache.cassandra.concurrent.InfiniteLoopExecutorTest-cdc_jdk17_x86_64 2 0 0
org.apache.cassandra.concurrent.InfiniteLoopExecutorTest-compression_jdk11_x86_64 2 0 0
org.apache.cassandra.concurrent.InfiniteLoopExecutorTest-compression_jdk17_x86_64 2 0 0
org.apache.cassandra.concurrent.InfiniteLoopExecutorTest-latest_jdk11_x86_64 2 0 0
org.apache.cassandra.concurrent.InfiniteLoopExecutorTest-latest_jdk17_x86_64 2 0 0
org.apache.cassandra.concurrent.InfiniteLoopExecutorTest-oa_jdk11_x86_64 2 0 0
org.apache.cassandra.concurrent.InfiniteLoopExecutorTest-oa_jdk17_x86_64 2 0 0
org.apache.cassandra.concurrent.InfiniteLoopExecutorTest-system_keyspace_directory_jdk11_x86_64 2 0 0
org.apache.cassandra.concurrent.InfiniteLoopExecutorTest-system_keyspace_directory_jdk17_x86_64 2 0 0
org.apache.cassandra.concurrent.LocalAwareExecutorPlusTest-_jdk11_x86_64 2 0 0
org.apache.cassandra.concurrent.LocalAwareExecutorPlusTest-_jdk17_x86_64 2 0 0
org.apache.cassandra.concurrent.LocalAwareExecutorPlusTest-cdc_jdk11_x86_64 2 0 0
org.apache.cassandra.concurrent.LocalAwareExecutorPlusTest-cdc_jdk17_x86_64 2 0 0
org.apache.cassandra.concurrent.LocalAwareExecutorPlusTest-compression_jdk11_x86_64 2 0 0
org.apache.cassandra.concurrent.LocalAwareExecutorPlusTest-compression_jdk17_x86_64 2 0 0
org.apache.cassandra.concurrent.LocalAwareExecutorPlusTest-latest_jdk11_x86_64 2 0 0
org.apache.cassandra.concurrent.LocalAwareExecutorPlusTest-latest_jdk17_x86_64 2 0 0
org.apache.cassandra.concurrent.LocalAwareExecutorPlusTest-oa_jdk11_x86_64 2 0 0
org.apache.cassandra.concurrent.LocalAwareExecutorPlusTest-oa_jdk17_x86_64 2 0 0
org.apache.cassandra.concurrent.LocalAwareExecutorPlusTest-system_keyspace_directory_jdk11_x86_64 2 0 0
org.apache.cassandra.concurrent.LocalAwareExecutorPlusTest-system_keyspace_directory_jdk17_x86_64 2 0 0
org.apache.cassandra.concurrent.LongOpOrderTest-_jdk11_x86_64 1 0 0
org.apache.cassandra.concurrent.LongOpOrderTest-_jdk17_x86_64 1 0 0
org.apache.cassandra.concurrent.LongSharedExecutorPoolTest-_jdk11_x86_64 0 0 1
org.apache.cassandra.concurrent.LongSharedExecutorPoolTest-_jdk17_x86_64 0 0 1
org.apache.cassandra.concurrent.SEPExecutorTest-_jdk11_x86_64 4 0 0
org.apache.cassandra.concurrent.SEPExecutorTest-_jdk17_x86_64 4 0 0
org.apache.cassandra.concurrent.SEPExecutorTest-cdc_jdk11_x86_64 4 0 0
org.apache.cassandra.concurrent.SEPExecutorTest-cdc_jdk17_x86_64 4 0 0
org.apache.cassandra.concurrent.SEPExecutorTest-compression_jdk11_x86_64 4 0 0
org.apache.cassandra.concurrent.SEPExecutorTest-compression_jdk17_x86_64 4 0 0
org.apache.cassandra.concurrent.SEPExecutorTest-latest_jdk11_x86_64 4 0 0
org.apache.cassandra.concurrent.SEPExecutorTest-latest_jdk17_x86_64 4 0 0
org.apache.cassandra.concurrent.SEPExecutorTest-oa_jdk11_x86_64 4 0 0
org.apache.cassandra.concurrent.SEPExecutorTest-oa_jdk17_x86_64 4 0 0
org.apache.cassandra.concurrent.SEPExecutorTest-system_keyspace_directory_jdk11_x86_64 4 0 0
org.apache.cassandra.concurrent.SEPExecutorTest-system_keyspace_directory_jdk17_x86_64 4 0 0
org.apache.cassandra.concurrent.WaitQueueTest-_jdk11_x86_64 2 0 0
org.apache.cassandra.concurrent.WaitQueueTest-_jdk17_x86_64 2 0 0
org.apache.cassandra.concurrent.WaitQueueTest-cdc_jdk11_x86_64 2 0 0
org.apache.cassandra.concurrent.WaitQueueTest-cdc_jdk17_x86_64 2 0 0
org.apache.cassandra.concurrent.WaitQueueTest-compression_jdk11_x86_64 2 0 0
org.apache.cassandra.concurrent.WaitQueueTest-compression_jdk17_x86_64 2 0 0
org.apache.cassandra.concurrent.WaitQueueTest-latest_jdk11_x86_64 2 0 0
org.apache.cassandra.concurrent.WaitQueueTest-latest_jdk17_x86_64 2 0 0
org.apache.cassandra.concurrent.WaitQueueTest-oa_jdk11_x86_64 2 0 0
org.apache.cassandra.concurrent.WaitQueueTest-oa_jdk17_x86_64 2 0 0
org.apache.cassandra.concurrent.WaitQueueTest-system_keyspace_directory_jdk11_x86_64 2 0 0
org.apache.cassandra.concurrent.WaitQueueTest-system_keyspace_directory_jdk17_x86_64 2 0 0
org.apache.cassandra.config.CassandraRelevantPropertiesTest-_jdk11_x86_64 10 0 0
org.apache.cassandra.config.CassandraRelevantPropertiesTest-_jdk17_x86_64 10 0 0
org.apache.cassandra.config.CassandraRelevantPropertiesTest-cdc_jdk11_x86_64 10 0 0
org.apache.cassandra.config.CassandraRelevantPropertiesTest-cdc_jdk17_x86_64 10 0 0
org.apache.cassandra.config.CassandraRelevantPropertiesTest-compression_jdk11_x86_64 10 0 0
org.apache.cassandra.config.CassandraRelevantPropertiesTest-compression_jdk17_x86_64 10 0 0
org.apache.cassandra.config.CassandraRelevantPropertiesTest-latest_jdk11_x86_64 10 0 0
org.apache.cassandra.config.CassandraRelevantPropertiesTest-latest_jdk17_x86_64 10 0 0
org.apache.cassandra.config.CassandraRelevantPropertiesTest-oa_jdk11_x86_64 10 0 0
org.apache.cassandra.config.CassandraRelevantPropertiesTest-oa_jdk17_x86_64 10 0 0
org.apache.cassandra.config.CassandraRelevantPropertiesTest-system_keyspace_directory_jdk11_x86_64 10 0 0
org.apache.cassandra.config.CassandraRelevantPropertiesTest-system_keyspace_directory_jdk17_x86_64 10 0 0
org.apache.cassandra.config.ConfigCompatibilityTest-_jdk11_x86_64 5 0 0
org.apache.cassandra.config.ConfigCompatibilityTest-_jdk17_x86_64 5 0 0
org.apache.cassandra.config.ConfigCompatibilityTest-cdc_jdk11_x86_64 5 0 0
org.apache.cassandra.config.ConfigCompatibilityTest-cdc_jdk17_x86_64 5 0 0
org.apache.cassandra.config.ConfigCompatibilityTest-compression_jdk11_x86_64 5 0 0
org.apache.cassandra.config.ConfigCompatibilityTest-compression_jdk17_x86_64 5 0 0
org.apache.cassandra.config.ConfigCompatibilityTest-latest_jdk11_x86_64 5 0 0
org.apache.cassandra.config.ConfigCompatibilityTest-latest_jdk17_x86_64 5 0 0
org.apache.cassandra.config.ConfigCompatibilityTest-oa_jdk11_x86_64 5 0 0
org.apache.cassandra.config.ConfigCompatibilityTest-oa_jdk17_x86_64 5 0 0
org.apache.cassandra.config.ConfigCompatibilityTest-system_keyspace_directory_jdk11_x86_64 5 0 0
org.apache.cassandra.config.ConfigCompatibilityTest-system_keyspace_directory_jdk17_x86_64 5 0 0
org.apache.cassandra.config.DataRateSpecTest-_jdk11_x86_64 11 0 0
org.apache.cassandra.config.DataRateSpecTest-_jdk17_x86_64 11 0 0
org.apache.cassandra.config.DataRateSpecTest-cdc_jdk11_x86_64 11 0 0
org.apache.cassandra.config.DataRateSpecTest-cdc_jdk17_x86_64 11 0 0
org.apache.cassandra.config.DataRateSpecTest-compression_jdk11_x86_64 11 0 0
org.apache.cassandra.config.DataRateSpecTest-compression_jdk17_x86_64 11 0 0
org.apache.cassandra.config.DataRateSpecTest-latest_jdk11_x86_64 11 0 0
org.apache.cassandra.config.DataRateSpecTest-latest_jdk17_x86_64 11 0 0
org.apache.cassandra.config.DataRateSpecTest-oa_jdk11_x86_64 11 0 0
org.apache.cassandra.config.DataRateSpecTest-oa_jdk17_x86_64 11 0 0
org.apache.cassandra.config.DataRateSpecTest-system_keyspace_directory_jdk11_x86_64 11 0 0
org.apache.cassandra.config.DataRateSpecTest-system_keyspace_directory_jdk17_x86_64 11 0 0
org.apache.cassandra.config.DataStorageSpecTest-_jdk11_x86_64 10 0 0
org.apache.cassandra.config.DataStorageSpecTest-_jdk17_x86_64 10 0 0
org.apache.cassandra.config.DataStorageSpecTest-cdc_jdk11_x86_64 10 0 0
org.apache.cassandra.config.DataStorageSpecTest-cdc_jdk17_x86_64 10 0 0
org.apache.cassandra.config.DataStorageSpecTest-compression_jdk11_x86_64 10 0 0
org.apache.cassandra.config.DataStorageSpecTest-compression_jdk17_x86_64 10 0 0
org.apache.cassandra.config.DataStorageSpecTest-latest_jdk11_x86_64 10 0 0
org.apache.cassandra.config.DataStorageSpecTest-latest_jdk17_x86_64 10 0 0
org.apache.cassandra.config.DataStorageSpecTest-oa_jdk11_x86_64 10 0 0
org.apache.cassandra.config.DataStorageSpecTest-oa_jdk17_x86_64 10 0 0
org.apache.cassandra.config.DataStorageSpecTest-system_keyspace_directory_jdk11_x86_64 10 0 0
org.apache.cassandra.config.DataStorageSpecTest-system_keyspace_directory_jdk17_x86_64 10 0 0
org.apache.cassandra.config.DatabaseDescriptorRefTest-_jdk11_x86_64 1 0 0
org.apache.cassandra.config.DatabaseDescriptorRefTest-_jdk17_x86_64 1 0 0
org.apache.cassandra.config.DatabaseDescriptorRefTest-cdc_jdk11_x86_64 1 0 0
org.apache.cassandra.config.DatabaseDescriptorRefTest-cdc_jdk17_x86_64 1 0 0
org.apache.cassandra.config.DatabaseDescriptorRefTest-compression_jdk11_x86_64 1 0 0
org.apache.cassandra.config.DatabaseDescriptorRefTest-compression_jdk17_x86_64 1 0 0
org.apache.cassandra.config.DatabaseDescriptorRefTest-latest_jdk11_x86_64 1 0 0
org.apache.cassandra.config.DatabaseDescriptorRefTest-latest_jdk17_x86_64 1 0 0
org.apache.cassandra.config.DatabaseDescriptorRefTest-oa_jdk11_x86_64 1 0 0
org.apache.cassandra.config.DatabaseDescriptorRefTest-oa_jdk17_x86_64 1 0 0
org.apache.cassandra.config.DatabaseDescriptorRefTest-system_keyspace_directory_jdk11_x86_64 1 0 0
org.apache.cassandra.config.DatabaseDescriptorRefTest-system_keyspace_directory_jdk17_x86_64 1 0 0
org.apache.cassandra.config.DatabaseDescriptorTest-_jdk11_x86_64 39 0 0
org.apache.cassandra.config.DatabaseDescriptorTest-_jdk17_x86_64 39 0 0
org.apache.cassandra.config.DatabaseDescriptorTest-cdc_jdk11_x86_64 39 0 0
org.apache.cassandra.config.DatabaseDescriptorTest-cdc_jdk17_x86_64 39 0 0
org.apache.cassandra.config.DatabaseDescriptorTest-compression_jdk11_x86_64 39 0 0
org.apache.cassandra.config.DatabaseDescriptorTest-compression_jdk17_x86_64 39 0 0
org.apache.cassandra.config.DatabaseDescriptorTest-latest_jdk11_x86_64 39 0 0
org.apache.cassandra.config.DatabaseDescriptorTest-latest_jdk17_x86_64 39 0 0
org.apache.cassandra.config.DatabaseDescriptorTest-oa_jdk11_x86_64 39 0 0
org.apache.cassandra.config.DatabaseDescriptorTest-oa_jdk17_x86_64 39 0 0
org.apache.cassandra.config.DatabaseDescriptorTest-system_keyspace_directory_jdk11_x86_64 39 0 0
org.apache.cassandra.config.DatabaseDescriptorTest-system_keyspace_directory_jdk17_x86_64 39 0 0
org.apache.cassandra.config.DefaultLoaderTest-_jdk11_x86_64 7 0 0
org.apache.cassandra.config.DefaultLoaderTest-_jdk17_x86_64 7 0 0
org.apache.cassandra.config.DefaultLoaderTest-cdc_jdk11_x86_64 7 0 0
org.apache.cassandra.config.DefaultLoaderTest-cdc_jdk17_x86_64 7 0 0
org.apache.cassandra.config.DefaultLoaderTest-compression_jdk11_x86_64 7 0 0
org.apache.cassandra.config.DefaultLoaderTest-compression_jdk17_x86_64 7 0 0
org.apache.cassandra.config.DefaultLoaderTest-latest_jdk11_x86_64 7 0 0
org.apache.cassandra.config.DefaultLoaderTest-latest_jdk17_x86_64 7 0 0
org.apache.cassandra.config.DefaultLoaderTest-oa_jdk11_x86_64 7 0 0
org.apache.cassandra.config.DefaultLoaderTest-oa_jdk17_x86_64 7 0 0
org.apache.cassandra.config.DefaultLoaderTest-system_keyspace_directory_jdk11_x86_64 7 0 0
org.apache.cassandra.config.DefaultLoaderTest-system_keyspace_directory_jdk17_x86_64 7 0 0
org.apache.cassandra.config.DurationSpecTest-_jdk11_x86_64 10 0 0
org.apache.cassandra.config.DurationSpecTest-_jdk17_x86_64 10 0 0
org.apache.cassandra.config.DurationSpecTest-cdc_jdk11_x86_64 10 0 0
org.apache.cassandra.config.DurationSpecTest-cdc_jdk17_x86_64 10 0 0
org.apache.cassandra.config.DurationSpecTest-compression_jdk11_x86_64 10 0 0
org.apache.cassandra.config.DurationSpecTest-compression_jdk17_x86_64 10 0 0
org.apache.cassandra.config.DurationSpecTest-latest_jdk11_x86_64 10 0 0
org.apache.cassandra.config.DurationSpecTest-latest_jdk17_x86_64 10 0 0
org.apache.cassandra.config.DurationSpecTest-oa_jdk11_x86_64 10 0 0
org.apache.cassandra.config.DurationSpecTest-oa_jdk17_x86_64 10 0 0
org.apache.cassandra.config.DurationSpecTest-system_keyspace_directory_jdk11_x86_64 10 0 0
org.apache.cassandra.config.DurationSpecTest-system_keyspace_directory_jdk17_x86_64 10 0 0
org.apache.cassandra.config.EncryptionOptionsEqualityTest-_jdk11_x86_64 7 0 0
org.apache.cassandra.config.EncryptionOptionsEqualityTest-_jdk17_x86_64 7 0 0
org.apache.cassandra.config.EncryptionOptionsEqualityTest-cdc_jdk11_x86_64 7 0 0
org.apache.cassandra.config.EncryptionOptionsEqualityTest-cdc_jdk17_x86_64 7 0 0
org.apache.cassandra.config.EncryptionOptionsEqualityTest-compression_jdk11_x86_64 7 0 0
org.apache.cassandra.config.EncryptionOptionsEqualityTest-compression_jdk17_x86_64 7 0 0
org.apache.cassandra.config.EncryptionOptionsEqualityTest-latest_jdk11_x86_64 7 0 0
org.apache.cassandra.config.EncryptionOptionsEqualityTest-latest_jdk17_x86_64 7 0 0
org.apache.cassandra.config.EncryptionOptionsEqualityTest-oa_jdk11_x86_64 7 0 0
org.apache.cassandra.config.EncryptionOptionsEqualityTest-oa_jdk17_x86_64 7 0 0
org.apache.cassandra.config.EncryptionOptionsEqualityTest-system_keyspace_directory_jdk11_x86_64 7 0 0
org.apache.cassandra.config.EncryptionOptionsEqualityTest-system_keyspace_directory_jdk17_x86_64 7 0 0
org.apache.cassandra.config.EncryptionOptionsTest-_jdk11_x86_64 8 0 0
org.apache.cassandra.config.EncryptionOptionsTest-_jdk17_x86_64 8 0 0
org.apache.cassandra.config.EncryptionOptionsTest-cdc_jdk11_x86_64 8 0 0
org.apache.cassandra.config.EncryptionOptionsTest-cdc_jdk17_x86_64 8 0 0
org.apache.cassandra.config.EncryptionOptionsTest-compression_jdk11_x86_64 8 0 0
org.apache.cassandra.config.EncryptionOptionsTest-compression_jdk17_x86_64 8 0 0
org.apache.cassandra.config.EncryptionOptionsTest-latest_jdk11_x86_64 8 0 0
org.apache.cassandra.config.EncryptionOptionsTest-latest_jdk17_x86_64 8 0 0
org.apache.cassandra.config.EncryptionOptionsTest-oa_jdk11_x86_64 8 0 0
org.apache.cassandra.config.EncryptionOptionsTest-oa_jdk17_x86_64 8 0 0
org.apache.cassandra.config.EncryptionOptionsTest-system_keyspace_directory_jdk11_x86_64 8 0 0
org.apache.cassandra.config.EncryptionOptionsTest-system_keyspace_directory_jdk17_x86_64 8 0 0
org.apache.cassandra.config.FailStartupDuplicateParamsTest-_jdk11_x86_64 4 0 0
org.apache.cassandra.config.FailStartupDuplicateParamsTest-_jdk17_x86_64 4 0 0
org.apache.cassandra.config.FailStartupDuplicateParamsTest-cdc_jdk11_x86_64 4 0 0
org.apache.cassandra.config.FailStartupDuplicateParamsTest-cdc_jdk17_x86_64 4 0 0
org.apache.cassandra.config.FailStartupDuplicateParamsTest-compression_jdk11_x86_64 4 0 0
org.apache.cassandra.config.FailStartupDuplicateParamsTest-compression_jdk17_x86_64 4 0 0
org.apache.cassandra.config.FailStartupDuplicateParamsTest-latest_jdk11_x86_64 4 0 0
org.apache.cassandra.config.FailStartupDuplicateParamsTest-latest_jdk17_x86_64 4 0 0
org.apache.cassandra.config.FailStartupDuplicateParamsTest-oa_jdk11_x86_64 4 0 0
org.apache.cassandra.config.FailStartupDuplicateParamsTest-oa_jdk17_x86_64 4 0 0
org.apache.cassandra.config.FailStartupDuplicateParamsTest-system_keyspace_directory_jdk11_x86_64 4 0 0
org.apache.cassandra.config.FailStartupDuplicateParamsTest-system_keyspace_directory_jdk17_x86_64 4 0 0
org.apache.cassandra.config.LoadOldYAMLBackwardCompatibilityTest-_jdk11_x86_64 1 0 0
org.apache.cassandra.config.LoadOldYAMLBackwardCompatibilityTest-_jdk17_x86_64 1 0 0
org.apache.cassandra.config.LoadOldYAMLBackwardCompatibilityTest-cdc_jdk11_x86_64 1 0 0
org.apache.cassandra.config.LoadOldYAMLBackwardCompatibilityTest-cdc_jdk17_x86_64 1 0 0
org.apache.cassandra.config.LoadOldYAMLBackwardCompatibilityTest-compression_jdk11_x86_64 1 0 0
org.apache.cassandra.config.LoadOldYAMLBackwardCompatibilityTest-compression_jdk17_x86_64 1 0 0
org.apache.cassandra.config.LoadOldYAMLBackwardCompatibilityTest-latest_jdk11_x86_64 1 0 0
org.apache.cassandra.config.LoadOldYAMLBackwardCompatibilityTest-latest_jdk17_x86_64 1 0 0
org.apache.cassandra.config.LoadOldYAMLBackwardCompatibilityTest-oa_jdk11_x86_64 1 0 0
org.apache.cassandra.config.LoadOldYAMLBackwardCompatibilityTest-oa_jdk17_x86_64 1 0 0
org.apache.cassandra.config.LoadOldYAMLBackwardCompatibilityTest-system_keyspace_directory_jdk11_x86_64 1 0 0
org.apache.cassandra.config.LoadOldYAMLBackwardCompatibilityTest-system_keyspace_directory_jdk17_x86_64 1 0 0
org.apache.cassandra.config.LoaderTest-_jdk11_x86_64 1 0 0
org.apache.cassandra.config.LoaderTest-_jdk17_x86_64 1 0 0
org.apache.cassandra.config.LoaderTest-cdc_jdk11_x86_64 1 0 0
org.apache.cassandra.config.LoaderTest-cdc_jdk17_x86_64 1 0 0
org.apache.cassandra.config.LoaderTest-compression_jdk11_x86_64 1 0 0
org.apache.cassandra.config.LoaderTest-compression_jdk17_x86_64 1 0 0
org.apache.cassandra.config.LoaderTest-latest_jdk11_x86_64 1 0 0
org.apache.cassandra.config.LoaderTest-latest_jdk17_x86_64 1 0 0
org.apache.cassandra.config.LoaderTest-oa_jdk11_x86_64 1 0 0
org.apache.cassandra.config.LoaderTest-oa_jdk17_x86_64 1 0 0
org.apache.cassandra.config.LoaderTest-system_keyspace_directory_jdk11_x86_64 1 0 0
org.apache.cassandra.config.LoaderTest-system_keyspace_directory_jdk17_x86_64 1 0 0
org.apache.cassandra.config.ParseAndConvertUnitsTest-_jdk11_x86_64 1 0 0
org.apache.cassandra.config.ParseAndConvertUnitsTest-_jdk17_x86_64 1 0 0
org.apache.cassandra.config.ParseAndConvertUnitsTest-cdc_jdk11_x86_64 1 0 0
org.apache.cassandra.config.ParseAndConvertUnitsTest-cdc_jdk17_x86_64 1 0 0
org.apache.cassandra.config.ParseAndConvertUnitsTest-compression_jdk11_x86_64 1 0 0
org.apache.cassandra.config.ParseAndConvertUnitsTest-compression_jdk17_x86_64 1 0 0
org.apache.cassandra.config.ParseAndConvertUnitsTest-latest_jdk11_x86_64 1 0 0
org.apache.cassandra.config.ParseAndConvertUnitsTest-latest_jdk17_x86_64 1 0 0
org.apache.cassandra.config.ParseAndConvertUnitsTest-oa_jdk11_x86_64 1 0 0
org.apache.cassandra.config.ParseAndConvertUnitsTest-oa_jdk17_x86_64 1 0 0
org.apache.cassandra.config.ParseAndConvertUnitsTest-system_keyspace_directory_jdk11_x86_64 1 0 0
org.apache.cassandra.config.ParseAndConvertUnitsTest-system_keyspace_directory_jdk17_x86_64 1 0 0
org.apache.cassandra.config.PropertiesTest-_jdk11_x86_64 3 0 0
org.apache.cassandra.config.PropertiesTest-_jdk17_x86_64 3 0 0
org.apache.cassandra.config.PropertiesTest-cdc_jdk11_x86_64 3 0 0
org.apache.cassandra.config.PropertiesTest-cdc_jdk17_x86_64 3 0 0
org.apache.cassandra.config.PropertiesTest-compression_jdk11_x86_64 3 0 0
org.apache.cassandra.config.PropertiesTest-compression_jdk17_x86_64 3 0 0
org.apache.cassandra.config.PropertiesTest-latest_jdk11_x86_64 3 0 0
org.apache.cassandra.config.PropertiesTest-latest_jdk17_x86_64 3 0 0
org.apache.cassandra.config.PropertiesTest-oa_jdk11_x86_64 3 0 0
org.apache.cassandra.config.PropertiesTest-oa_jdk17_x86_64 3 0 0
org.apache.cassandra.config.PropertiesTest-system_keyspace_directory_jdk11_x86_64 3 0 0
org.apache.cassandra.config.PropertiesTest-system_keyspace_directory_jdk17_x86_64 3 0 0
org.apache.cassandra.config.StartupCheckOptionsTest-_jdk11_x86_64 6 0 0
org.apache.cassandra.config.StartupCheckOptionsTest-_jdk17_x86_64 6 0 0
org.apache.cassandra.config.StartupCheckOptionsTest-cdc_jdk11_x86_64 6 0 0
org.apache.cassandra.config.StartupCheckOptionsTest-cdc_jdk17_x86_64 6 0 0
org.apache.cassandra.config.StartupCheckOptionsTest-compression_jdk11_x86_64 6 0 0
org.apache.cassandra.config.StartupCheckOptionsTest-compression_jdk17_x86_64 6 0 0
org.apache.cassandra.config.StartupCheckOptionsTest-latest_jdk11_x86_64 6 0 0
org.apache.cassandra.config.StartupCheckOptionsTest-latest_jdk17_x86_64 6 0 0
org.apache.cassandra.config.StartupCheckOptionsTest-oa_jdk11_x86_64 6 0 0
org.apache.cassandra.config.StartupCheckOptionsTest-oa_jdk17_x86_64 6 0 0
org.apache.cassandra.config.StartupCheckOptionsTest-system_keyspace_directory_jdk11_x86_64 6 0 0
org.apache.cassandra.config.StartupCheckOptionsTest-system_keyspace_directory_jdk17_x86_64 6 0 0
org.apache.cassandra.config.StorageAttachedIndexOptionsTest-_jdk11_x86_64 1 0 0
org.apache.cassandra.config.StorageAttachedIndexOptionsTest-_jdk17_x86_64 1 0 0
org.apache.cassandra.config.StorageAttachedIndexOptionsTest-cdc_jdk11_x86_64 1 0 0
org.apache.cassandra.config.StorageAttachedIndexOptionsTest-cdc_jdk17_x86_64 1 0 0
org.apache.cassandra.config.StorageAttachedIndexOptionsTest-compression_jdk11_x86_64 1 0 0
org.apache.cassandra.config.StorageAttachedIndexOptionsTest-compression_jdk17_x86_64 1 0 0
org.apache.cassandra.config.StorageAttachedIndexOptionsTest-latest_jdk11_x86_64 1 0 0
org.apache.cassandra.config.StorageAttachedIndexOptionsTest-latest_jdk17_x86_64 1 0 0
org.apache.cassandra.config.StorageAttachedIndexOptionsTest-oa_jdk11_x86_64 1 0 0
org.apache.cassandra.config.StorageAttachedIndexOptionsTest-oa_jdk17_x86_64 1 0 0
org.apache.cassandra.config.StorageAttachedIndexOptionsTest-system_keyspace_directory_jdk11_x86_64 1 0 0
org.apache.cassandra.config.StorageAttachedIndexOptionsTest-system_keyspace_directory_jdk17_x86_64 1 0 0
org.apache.cassandra.config.YamlConfigurationLoaderTest-_jdk11_x86_64 19 0 0
org.apache.cassandra.config.YamlConfigurationLoaderTest-_jdk17_x86_64 19 0 0
org.apache.cassandra.config.YamlConfigurationLoaderTest-cdc_jdk11_x86_64 19 0 0
org.apache.cassandra.config.YamlConfigurationLoaderTest-cdc_jdk17_x86_64 19 0 0
org.apache.cassandra.config.YamlConfigurationLoaderTest-compression_jdk11_x86_64 19 0 0
org.apache.cassandra.config.YamlConfigurationLoaderTest-compression_jdk17_x86_64 19 0 0
org.apache.cassandra.config.YamlConfigurationLoaderTest-latest_jdk11_x86_64 19 0 0
org.apache.cassandra.config.YamlConfigurationLoaderTest-latest_jdk17_x86_64 19 0 0
org.apache.cassandra.config.YamlConfigurationLoaderTest-oa_jdk11_x86_64 19 0 0
org.apache.cassandra.config.YamlConfigurationLoaderTest-oa_jdk17_x86_64 19 0 0
org.apache.cassandra.config.YamlConfigurationLoaderTest-system_keyspace_directory_jdk11_x86_64 19 0 0
org.apache.cassandra.config.YamlConfigurationLoaderTest-system_keyspace_directory_jdk17_x86_64 19 0 0
org.apache.cassandra.cql.jdbc.JdbcDecimalTest-_jdk11_x86_64 1 0 0
org.apache.cassandra.cql.jdbc.JdbcDecimalTest-_jdk17_x86_64 1 0 0
org.apache.cassandra.cql.jdbc.JdbcDecimalTest-cdc_jdk11_x86_64 1 0 0
org.apache.cassandra.cql.jdbc.JdbcDecimalTest-cdc_jdk17_x86_64 1 0 0
org.apache.cassandra.cql.jdbc.JdbcDecimalTest-compression_jdk11_x86_64 1 0 0
org.apache.cassandra.cql.jdbc.JdbcDecimalTest-compression_jdk17_x86_64 1 0 0
org.apache.cassandra.cql.jdbc.JdbcDecimalTest-latest_jdk11_x86_64 1 0 0
org.apache.cassandra.cql.jdbc.JdbcDecimalTest-latest_jdk17_x86_64 1 0 0
org.apache.cassandra.cql.jdbc.JdbcDecimalTest-oa_jdk11_x86_64 1 0 0
org.apache.cassandra.cql.jdbc.JdbcDecimalTest-oa_jdk17_x86_64 1 0 0
org.apache.cassandra.cql.jdbc.JdbcDecimalTest-system_keyspace_directory_jdk11_x86_64 1 0 0
org.apache.cassandra.cql.jdbc.JdbcDecimalTest-system_keyspace_directory_jdk17_x86_64 1 0 0
org.apache.cassandra.cql3.AlterSchemaStatementTest-_jdk11_x86_64 2 0 0
org.apache.cassandra.cql3.AlterSchemaStatementTest-_jdk17_x86_64 2 0 0
org.apache.cassandra.cql3.AlterSchemaStatementTest-cdc_jdk11_x86_64 2 0 0
org.apache.cassandra.cql3.AlterSchemaStatementTest-cdc_jdk17_x86_64 2 0 0
org.apache.cassandra.cql3.AlterSchemaStatementTest-compression_jdk11_x86_64 2 0 0
org.apache.cassandra.cql3.AlterSchemaStatementTest-compression_jdk17_x86_64 2 0 0
org.apache.cassandra.cql3.AlterSchemaStatementTest-latest_jdk11_x86_64 2 0 0
org.apache.cassandra.cql3.AlterSchemaStatementTest-latest_jdk17_x86_64 2 0 0
org.apache.cassandra.cql3.AlterSchemaStatementTest-oa_jdk11_x86_64 2 0 0
org.apache.cassandra.cql3.AlterSchemaStatementTest-oa_jdk17_x86_64 2 0 0
org.apache.cassandra.cql3.AlterSchemaStatementTest-system_keyspace_directory_jdk11_x86_64 2 0 0
org.apache.cassandra.cql3.AlterSchemaStatementTest-system_keyspace_directory_jdk17_x86_64 2 0 0
org.apache.cassandra.cql3.AssignmentTestableTest-_jdk11_x86_64 1 0 0
org.apache.cassandra.cql3.AssignmentTestableTest-_jdk17_x86_64 1 0 0
org.apache.cassandra.cql3.AssignmentTestableTest-cdc_jdk11_x86_64 1 0 0
org.apache.cassandra.cql3.AssignmentTestableTest-cdc_jdk17_x86_64 1 0 0
org.apache.cassandra.cql3.AssignmentTestableTest-compression_jdk11_x86_64 1 0 0
org.apache.cassandra.cql3.AssignmentTestableTest-compression_jdk17_x86_64 1 0 0
org.apache.cassandra.cql3.AssignmentTestableTest-latest_jdk11_x86_64 1 0 0
org.apache.cassandra.cql3.AssignmentTestableTest-latest_jdk17_x86_64 1 0 0
org.apache.cassandra.cql3.AssignmentTestableTest-oa_jdk11_x86_64 1 0 0
org.apache.cassandra.cql3.AssignmentTestableTest-oa_jdk17_x86_64 1 0 0
org.apache.cassandra.cql3.AssignmentTestableTest-system_keyspace_directory_jdk11_x86_64 1 0 0
org.apache.cassandra.cql3.AssignmentTestableTest-system_keyspace_directory_jdk17_x86_64 1 0 0
org.apache.cassandra.cql3.BatchTest-_jdk11_x86_64 13 0 0
org.apache.cassandra.cql3.BatchTest-_jdk17_x86_64 13 0 0
org.apache.cassandra.cql3.BatchTest-cdc_jdk11_x86_64 13 0 0
org.apache.cassandra.cql3.BatchTest-cdc_jdk17_x86_64 13 0 0
org.apache.cassandra.cql3.BatchTest-compression_jdk11_x86_64 13 0 0
org.apache.cassandra.cql3.BatchTest-compression_jdk17_x86_64 13 0 0
org.apache.cassandra.cql3.BatchTest-latest_jdk11_x86_64 13 0 0
org.apache.cassandra.cql3.BatchTest-latest_jdk17_x86_64 13 0 0
org.apache.cassandra.cql3.BatchTest-oa_jdk11_x86_64 13 0 0
org.apache.cassandra.cql3.BatchTest-oa_jdk17_x86_64 13 0 0
org.apache.cassandra.cql3.BatchTest-system_keyspace_directory_jdk11_x86_64 13 0 0
org.apache.cassandra.cql3.BatchTest-system_keyspace_directory_jdk17_x86_64 13 0 0
org.apache.cassandra.cql3.CDCStatementTest-_jdk11_x86_64 3 0 0
org.apache.cassandra.cql3.CDCStatementTest-_jdk17_x86_64 3 0 0
org.apache.cassandra.cql3.CDCStatementTest-cdc_jdk11_x86_64 3 0 0
org.apache.cassandra.cql3.CDCStatementTest-cdc_jdk17_x86_64 3 0 0
org.apache.cassandra.cql3.CDCStatementTest-compression_jdk11_x86_64 3 0 0
org.apache.cassandra.cql3.CDCStatementTest-compression_jdk17_x86_64 3 0 0
org.apache.cassandra.cql3.CDCStatementTest-latest_jdk11_x86_64 3 0 0
org.apache.cassandra.cql3.CDCStatementTest-latest_jdk17_x86_64 3 0 0
org.apache.cassandra.cql3.CDCStatementTest-oa_jdk11_x86_64 3 0 0
org.apache.cassandra.cql3.CDCStatementTest-oa_jdk17_x86_64 3 0 0
org.apache.cassandra.cql3.CDCStatementTest-system_keyspace_directory_jdk11_x86_64 3 0 0
org.apache.cassandra.cql3.CDCStatementTest-system_keyspace_directory_jdk17_x86_64 3 0 0
org.apache.cassandra.cql3.CIDRTest-_jdk11_x86_64 11 0 0
org.apache.cassandra.cql3.CIDRTest-_jdk17_x86_64 11 0 0
org.apache.cassandra.cql3.CIDRTest-cdc_jdk11_x86_64 11 0 0
org.apache.cassandra.cql3.CIDRTest-cdc_jdk17_x86_64 11 0 0
org.apache.cassandra.cql3.CIDRTest-compression_jdk11_x86_64 11 0 0
org.apache.cassandra.cql3.CIDRTest-compression_jdk17_x86_64 11 0 0
org.apache.cassandra.cql3.CIDRTest-latest_jdk11_x86_64 11 0 0
org.apache.cassandra.cql3.CIDRTest-latest_jdk17_x86_64 11 0 0
org.apache.cassandra.cql3.CIDRTest-oa_jdk11_x86_64 11 0 0
org.apache.cassandra.cql3.CIDRTest-oa_jdk17_x86_64 11 0 0
org.apache.cassandra.cql3.CIDRTest-system_keyspace_directory_jdk11_x86_64 11 0 0
org.apache.cassandra.cql3.CIDRTest-system_keyspace_directory_jdk17_x86_64 11 0 0
org.apache.cassandra.cql3.CQLTesterTest-_jdk11_x86_64 1 0 0
org.apache.cassandra.cql3.CQLTesterTest-_jdk17_x86_64 1 0 0
org.apache.cassandra.cql3.CQLTesterTest-cdc_jdk11_x86_64 1 0 0
org.apache.cassandra.cql3.CQLTesterTest-cdc_jdk17_x86_64 1 0 0
org.apache.cassandra.cql3.CQLTesterTest-compression_jdk11_x86_64 1 0 0
org.apache.cassandra.cql3.CQLTesterTest-compression_jdk17_x86_64 1 0 0
org.apache.cassandra.cql3.CQLTesterTest-latest_jdk11_x86_64 1 0 0
org.apache.cassandra.cql3.CQLTesterTest-latest_jdk17_x86_64 1 0 0
org.apache.cassandra.cql3.CQLTesterTest-oa_jdk11_x86_64 1 0 0
org.apache.cassandra.cql3.CQLTesterTest-oa_jdk17_x86_64 1 0 0
org.apache.cassandra.cql3.CQLTesterTest-system_keyspace_directory_jdk11_x86_64 1 0 0
org.apache.cassandra.cql3.CQLTesterTest-system_keyspace_directory_jdk17_x86_64 1 0 0
org.apache.cassandra.cql3.ColumnIdentifierTest-_jdk11_x86_64 4 0 0
org.apache.cassandra.cql3.ColumnIdentifierTest-_jdk17_x86_64 4 0 0
org.apache.cassandra.cql3.ColumnIdentifierTest-cdc_jdk11_x86_64 4 0 0
org.apache.cassandra.cql3.ColumnIdentifierTest-cdc_jdk17_x86_64 4 0 0
org.apache.cassandra.cql3.ColumnIdentifierTest-compression_jdk11_x86_64 4 0 0
org.apache.cassandra.cql3.ColumnIdentifierTest-compression_jdk17_x86_64 4 0 0
org.apache.cassandra.cql3.ColumnIdentifierTest-latest_jdk11_x86_64 4 0 0
org.apache.cassandra.cql3.ColumnIdentifierTest-latest_jdk17_x86_64 4 0 0
org.apache.cassandra.cql3.ColumnIdentifierTest-oa_jdk11_x86_64 4 0 0
org.apache.cassandra.cql3.ColumnIdentifierTest-oa_jdk17_x86_64 4 0 0
org.apache.cassandra.cql3.ColumnIdentifierTest-system_keyspace_directory_jdk11_x86_64 4 0 0
org.apache.cassandra.cql3.ColumnIdentifierTest-system_keyspace_directory_jdk17_x86_64 4 0 0
org.apache.cassandra.cql3.CorruptionTest-_jdk11_x86_64 1 0 0
org.apache.cassandra.cql3.CorruptionTest-_jdk17_x86_64 1 0 0
org.apache.cassandra.cql3.CqlParserTest-_jdk11_x86_64 3 0 0
org.apache.cassandra.cql3.CqlParserTest-_jdk17_x86_64 3 0 0
org.apache.cassandra.cql3.CqlParserTest-cdc_jdk11_x86_64 3 0 0
org.apache.cassandra.cql3.CqlParserTest-cdc_jdk17_x86_64 3 0 0
org.apache.cassandra.cql3.CqlParserTest-compression_jdk11_x86_64 3 0 0
org.apache.cassandra.cql3.CqlParserTest-compression_jdk17_x86_64 3 0 0
org.apache.cassandra.cql3.CqlParserTest-latest_jdk11_x86_64 3 0 0
org.apache.cassandra.cql3.CqlParserTest-latest_jdk17_x86_64 3 0 0
org.apache.cassandra.cql3.CqlParserTest-oa_jdk11_x86_64 3 0 0
org.apache.cassandra.cql3.CqlParserTest-oa_jdk17_x86_64 3 0 0
org.apache.cassandra.cql3.CqlParserTest-system_keyspace_directory_jdk11_x86_64 3 0 0
org.apache.cassandra.cql3.CqlParserTest-system_keyspace_directory_jdk17_x86_64 3 0 0
org.apache.cassandra.cql3.CustomNowInSecondsTest-_jdk11_x86_64 5 0 0
org.apache.cassandra.cql3.CustomNowInSecondsTest-_jdk17_x86_64 5 0 0
org.apache.cassandra.cql3.CustomNowInSecondsTest-cdc_jdk11_x86_64 5 0 0
org.apache.cassandra.cql3.CustomNowInSecondsTest-cdc_jdk17_x86_64 5 0 0
org.apache.cassandra.cql3.CustomNowInSecondsTest-compression_jdk11_x86_64 5 0 0
org.apache.cassandra.cql3.CustomNowInSecondsTest-compression_jdk17_x86_64 5 0 0
org.apache.cassandra.cql3.CustomNowInSecondsTest-latest_jdk11_x86_64 5 0 0
org.apache.cassandra.cql3.CustomNowInSecondsTest-latest_jdk17_x86_64 5 0 0
org.apache.cassandra.cql3.CustomNowInSecondsTest-oa_jdk11_x86_64 5 0 0
org.apache.cassandra.cql3.CustomNowInSecondsTest-oa_jdk17_x86_64 5 0 0
org.apache.cassandra.cql3.CustomNowInSecondsTest-system_keyspace_directory_jdk11_x86_64 5 0 0
org.apache.cassandra.cql3.CustomNowInSecondsTest-system_keyspace_directory_jdk17_x86_64 5 0 0
org.apache.cassandra.cql3.DecoratedKeyPrefixesTest-_jdk11_x86_64 6 0 0
org.apache.cassandra.cql3.DecoratedKeyPrefixesTest-_jdk17_x86_64 6 0 0
org.apache.cassandra.cql3.DecoratedKeyPrefixesTest-cdc_jdk11_x86_64 6 0 0
org.apache.cassandra.cql3.DecoratedKeyPrefixesTest-cdc_jdk17_x86_64 6 0 0
org.apache.cassandra.cql3.DecoratedKeyPrefixesTest-compression_jdk11_x86_64 6 0 0
org.apache.cassandra.cql3.DecoratedKeyPrefixesTest-compression_jdk17_x86_64 6 0 0
org.apache.cassandra.cql3.DecoratedKeyPrefixesTest-latest_jdk11_x86_64 6 0 0
org.apache.cassandra.cql3.DecoratedKeyPrefixesTest-latest_jdk17_x86_64 6 0 0
org.apache.cassandra.cql3.DecoratedKeyPrefixesTest-oa_jdk11_x86_64 6 0 0
org.apache.cassandra.cql3.DecoratedKeyPrefixesTest-oa_jdk17_x86_64 6 0 0
org.apache.cassandra.cql3.DecoratedKeyPrefixesTest-system_keyspace_directory_jdk11_x86_64 6 0 0
org.apache.cassandra.cql3.DecoratedKeyPrefixesTest-system_keyspace_directory_jdk17_x86_64 6 0 0
org.apache.cassandra.cql3.DeleteTest-_jdk11_x86_64 1 0 0
org.apache.cassandra.cql3.DeleteTest-_jdk17_x86_64 1 0 0
org.apache.cassandra.cql3.DeleteTest-cdc_jdk11_x86_64 1 0 0
org.apache.cassandra.cql3.DeleteTest-cdc_jdk17_x86_64 1 0 0
org.apache.cassandra.cql3.DeleteTest-compression_jdk11_x86_64 1 0 0
org.apache.cassandra.cql3.DeleteTest-compression_jdk17_x86_64 1 0 0
org.apache.cassandra.cql3.DeleteTest-latest_jdk11_x86_64 1 0 0
org.apache.cassandra.cql3.DeleteTest-latest_jdk17_x86_64 1 0 0
org.apache.cassandra.cql3.DeleteTest-oa_jdk11_x86_64 1 0 0
org.apache.cassandra.cql3.DeleteTest-oa_jdk17_x86_64 1 0 0
org.apache.cassandra.cql3.DeleteTest-system_keyspace_directory_jdk11_x86_64 1 0 0
org.apache.cassandra.cql3.DeleteTest-system_keyspace_directory_jdk17_x86_64 1 0 0
org.apache.cassandra.cql3.DistinctQueryPagingTest-_jdk11_x86_64 5 0 0
org.apache.cassandra.cql3.DistinctQueryPagingTest-_jdk17_x86_64 5 0 0
org.apache.cassandra.cql3.DistinctQueryPagingTest-cdc_jdk11_x86_64 5 0 0
org.apache.cassandra.cql3.DistinctQueryPagingTest-cdc_jdk17_x86_64 5 0 0
org.apache.cassandra.cql3.DistinctQueryPagingTest-compression_jdk11_x86_64 5 0 0
org.apache.cassandra.cql3.DistinctQueryPagingTest-compression_jdk17_x86_64 5 0 0
org.apache.cassandra.cql3.DistinctQueryPagingTest-latest_jdk11_x86_64 5 0 0
org.apache.cassandra.cql3.DistinctQueryPagingTest-latest_jdk17_x86_64 5 0 0
org.apache.cassandra.cql3.DistinctQueryPagingTest-oa_jdk11_x86_64 5 0 0
org.apache.cassandra.cql3.DistinctQueryPagingTest-oa_jdk17_x86_64 5 0 0
org.apache.cassandra.cql3.DistinctQueryPagingTest-system_keyspace_directory_jdk11_x86_64 5 0 0
org.apache.cassandra.cql3.DistinctQueryPagingTest-system_keyspace_directory_jdk17_x86_64 5 0 0
org.apache.cassandra.cql3.DurationTest-_jdk11_x86_64 19 0 0
org.apache.cassandra.cql3.DurationTest-_jdk17_x86_64 19 0 0
org.apache.cassandra.cql3.DurationTest-cdc_jdk11_x86_64 19 0 0
org.apache.cassandra.cql3.DurationTest-cdc_jdk17_x86_64 19 0 0
org.apache.cassandra.cql3.DurationTest-compression_jdk11_x86_64 19 0 0
org.apache.cassandra.cql3.DurationTest-compression_jdk17_x86_64 19 0 0
org.apache.cassandra.cql3.DurationTest-latest_jdk11_x86_64 19 0 0
org.apache.cassandra.cql3.DurationTest-latest_jdk17_x86_64 19 0 0
org.apache.cassandra.cql3.DurationTest-oa_jdk11_x86_64 19 0 0
org.apache.cassandra.cql3.DurationTest-oa_jdk17_x86_64 19 0 0
org.apache.cassandra.cql3.DurationTest-system_keyspace_directory_jdk11_x86_64 19 0 0
org.apache.cassandra.cql3.DurationTest-system_keyspace_directory_jdk17_x86_64 19 0 0
org.apache.cassandra.cql3.EmptyValuesTest-_jdk11_x86_64 9 0 5
org.apache.cassandra.cql3.EmptyValuesTest-_jdk17_x86_64 9 0 5
org.apache.cassandra.cql3.EmptyValuesTest-cdc_jdk11_x86_64 9 0 5
org.apache.cassandra.cql3.EmptyValuesTest-cdc_jdk17_x86_64 9 0 5
org.apache.cassandra.cql3.EmptyValuesTest-compression_jdk11_x86_64 9 0 5
org.apache.cassandra.cql3.EmptyValuesTest-compression_jdk17_x86_64 9 0 5
org.apache.cassandra.cql3.EmptyValuesTest-latest_jdk11_x86_64 9 0 5
org.apache.cassandra.cql3.EmptyValuesTest-latest_jdk17_x86_64 9 0 5
org.apache.cassandra.cql3.EmptyValuesTest-oa_jdk11_x86_64 9 0 5
org.apache.cassandra.cql3.EmptyValuesTest-oa_jdk17_x86_64 9 0 5
org.apache.cassandra.cql3.EmptyValuesTest-system_keyspace_directory_jdk11_x86_64 9 0 5
org.apache.cassandra.cql3.EmptyValuesTest-system_keyspace_directory_jdk17_x86_64 9 0 5
org.apache.cassandra.cql3.ErrorCollectorTest-_jdk11_x86_64 6 0 0
org.apache.cassandra.cql3.ErrorCollectorTest-_jdk17_x86_64 6 0 0
org.apache.cassandra.cql3.ErrorCollectorTest-cdc_jdk11_x86_64 6 0 0
org.apache.cassandra.cql3.ErrorCollectorTest-cdc_jdk17_x86_64 6 0 0
org.apache.cassandra.cql3.ErrorCollectorTest-compression_jdk11_x86_64 6 0 0
org.apache.cassandra.cql3.ErrorCollectorTest-compression_jdk17_x86_64 6 0 0
org.apache.cassandra.cql3.ErrorCollectorTest-latest_jdk11_x86_64 6 0 0
org.apache.cassandra.cql3.ErrorCollectorTest-latest_jdk17_x86_64 6 0 0
org.apache.cassandra.cql3.ErrorCollectorTest-oa_jdk11_x86_64 6 0 0
org.apache.cassandra.cql3.ErrorCollectorTest-oa_jdk17_x86_64 6 0 0
org.apache.cassandra.cql3.ErrorCollectorTest-system_keyspace_directory_jdk11_x86_64 6 0 0
org.apache.cassandra.cql3.ErrorCollectorTest-system_keyspace_directory_jdk17_x86_64 6 0 0
org.apache.cassandra.cql3.GcCompactionTest-_jdk11_x86_64 12 0 0
org.apache.cassandra.cql3.GcCompactionTest-_jdk17_x86_64 12 0 0
org.apache.cassandra.cql3.GcCompactionTest-cdc_jdk11_x86_64 12 0 0
org.apache.cassandra.cql3.GcCompactionTest-cdc_jdk17_x86_64 12 0 0
org.apache.cassandra.cql3.GcCompactionTest-compression_jdk11_x86_64 12 0 0
org.apache.cassandra.cql3.GcCompactionTest-compression_jdk17_x86_64 12 0 0
org.apache.cassandra.cql3.GcCompactionTest-latest_jdk11_x86_64 12 0 0
org.apache.cassandra.cql3.GcCompactionTest-latest_jdk17_x86_64 12 0 0
org.apache.cassandra.cql3.GcCompactionTest-oa_jdk11_x86_64 12 0 0
org.apache.cassandra.cql3.GcCompactionTest-oa_jdk17_x86_64 12 0 0
org.apache.cassandra.cql3.GcCompactionTest-system_keyspace_directory_jdk11_x86_64 12 0 0
org.apache.cassandra.cql3.GcCompactionTest-system_keyspace_directory_jdk17_x86_64 12 0 0
org.apache.cassandra.cql3.IndexQueryPagingTest-_jdk11_x86_64 5 0 0
org.apache.cassandra.cql3.IndexQueryPagingTest-_jdk17_x86_64 5 0 0
org.apache.cassandra.cql3.IndexQueryPagingTest-cdc_jdk11_x86_64 5 0 0
org.apache.cassandra.cql3.IndexQueryPagingTest-cdc_jdk17_x86_64 5 0 0
org.apache.cassandra.cql3.IndexQueryPagingTest-compression_jdk11_x86_64 5 0 0
org.apache.cassandra.cql3.IndexQueryPagingTest-compression_jdk17_x86_64 5 0 0
org.apache.cassandra.cql3.IndexQueryPagingTest-latest_jdk11_x86_64 5 0 0
org.apache.cassandra.cql3.IndexQueryPagingTest-latest_jdk17_x86_64 5 0 0
org.apache.cassandra.cql3.IndexQueryPagingTest-oa_jdk11_x86_64 5 0 0
org.apache.cassandra.cql3.IndexQueryPagingTest-oa_jdk17_x86_64 5 0 0
org.apache.cassandra.cql3.IndexQueryPagingTest-system_keyspace_directory_jdk11_x86_64 5 0 0
org.apache.cassandra.cql3.IndexQueryPagingTest-system_keyspace_directory_jdk17_x86_64 5 0 0
org.apache.cassandra.cql3.KeyCacheCqlTest-_jdk11_x86_64 10 0 0
org.apache.cassandra.cql3.KeyCacheCqlTest-_jdk17_x86_64 10 0 0
org.apache.cassandra.cql3.KeyCacheCqlTest-cdc_jdk11_x86_64 10 0 0
org.apache.cassandra.cql3.KeyCacheCqlTest-cdc_jdk17_x86_64 10 0 0
org.apache.cassandra.cql3.KeyCacheCqlTest-compression_jdk11_x86_64 10 0 0
org.apache.cassandra.cql3.KeyCacheCqlTest-compression_jdk17_x86_64 10 0 0
org.apache.cassandra.cql3.KeyCacheCqlTest-latest_jdk11_x86_64 10 0 0
org.apache.cassandra.cql3.KeyCacheCqlTest-latest_jdk17_x86_64 10 0 0
org.apache.cassandra.cql3.KeyCacheCqlTest-oa_jdk11_x86_64 10 0 0
org.apache.cassandra.cql3.KeyCacheCqlTest-oa_jdk17_x86_64 10 0 0
org.apache.cassandra.cql3.KeyCacheCqlTest-system_keyspace_directory_jdk11_x86_64 10 0 0
org.apache.cassandra.cql3.KeyCacheCqlTest-system_keyspace_directory_jdk17_x86_64 10 0 0
org.apache.cassandra.cql3.KeywordSplit1Test-_jdk11_x86_64 77 0 0
org.apache.cassandra.cql3.KeywordSplit1Test-_jdk17_x86_64 77 0 0
org.apache.cassandra.cql3.KeywordSplit1Test-cdc_jdk11_x86_64 77 0 0
org.apache.cassandra.cql3.KeywordSplit1Test-cdc_jdk17_x86_64 77 0 0
org.apache.cassandra.cql3.KeywordSplit1Test-compression_jdk11_x86_64 77 0 0
org.apache.cassandra.cql3.KeywordSplit1Test-compression_jdk17_x86_64 77 0 0
org.apache.cassandra.cql3.KeywordSplit1Test-latest_jdk11_x86_64 77 0 0
org.apache.cassandra.cql3.KeywordSplit1Test-latest_jdk17_x86_64 77 0 0
org.apache.cassandra.cql3.KeywordSplit1Test-oa_jdk11_x86_64 77 0 0
org.apache.cassandra.cql3.KeywordSplit1Test-oa_jdk17_x86_64 77 0 0
org.apache.cassandra.cql3.KeywordSplit1Test-system_keyspace_directory_jdk11_x86_64 77 0 0
org.apache.cassandra.cql3.KeywordSplit1Test-system_keyspace_directory_jdk17_x86_64 77 0 0
org.apache.cassandra.cql3.KeywordSplitTest-_jdk11_x86_64 77 0 0
org.apache.cassandra.cql3.KeywordSplitTest-_jdk17_x86_64 77 0 0
org.apache.cassandra.cql3.KeywordSplitTest-cdc_jdk11_x86_64 77 0 0
org.apache.cassandra.cql3.KeywordSplitTest-cdc_jdk17_x86_64 77 0 0
org.apache.cassandra.cql3.KeywordSplitTest-compression_jdk11_x86_64 77 0 0
org.apache.cassandra.cql3.KeywordSplitTest-compression_jdk17_x86_64 77 0 0
org.apache.cassandra.cql3.KeywordSplitTest-latest_jdk11_x86_64 77 0 0
org.apache.cassandra.cql3.KeywordSplitTest-latest_jdk17_x86_64 77 0 0
org.apache.cassandra.cql3.KeywordSplitTest-oa_jdk11_x86_64 77 0 0
org.apache.cassandra.cql3.KeywordSplitTest-oa_jdk17_x86_64 77 0 0
org.apache.cassandra.cql3.KeywordSplitTest-system_keyspace_directory_jdk11_x86_64 77 0 0
org.apache.cassandra.cql3.KeywordSplitTest-system_keyspace_directory_jdk17_x86_64 77 0 0
org.apache.cassandra.cql3.ManyRowsTest-_jdk11_x86_64 2 0 0
org.apache.cassandra.cql3.ManyRowsTest-_jdk17_x86_64 2 0 0
org.apache.cassandra.cql3.NodeLocalConsistencyTest-_jdk11_x86_64 3 0 0
org.apache.cassandra.cql3.NodeLocalConsistencyTest-_jdk17_x86_64 3 0 0
org.apache.cassandra.cql3.NodeLocalConsistencyTest-cdc_jdk11_x86_64 3 0 0
org.apache.cassandra.cql3.NodeLocalConsistencyTest-cdc_jdk17_x86_64 3 0 0
org.apache.cassandra.cql3.NodeLocalConsistencyTest-compression_jdk11_x86_64 3 0 0
org.apache.cassandra.cql3.NodeLocalConsistencyTest-compression_jdk17_x86_64 3 0 0
org.apache.cassandra.cql3.NodeLocalConsistencyTest-latest_jdk11_x86_64 3 0 0
org.apache.cassandra.cql3.NodeLocalConsistencyTest-latest_jdk17_x86_64 3 0 0
org.apache.cassandra.cql3.NodeLocalConsistencyTest-oa_jdk11_x86_64 3 0 0
org.apache.cassandra.cql3.NodeLocalConsistencyTest-oa_jdk17_x86_64 3 0 0
org.apache.cassandra.cql3.NodeLocalConsistencyTest-system_keyspace_directory_jdk11_x86_64 3 0 0
org.apache.cassandra.cql3.NodeLocalConsistencyTest-system_keyspace_directory_jdk17_x86_64 3 0 0
org.apache.cassandra.cql3.NonNativeTimestampTest-_jdk11_x86_64 1 0 0
org.apache.cassandra.cql3.NonNativeTimestampTest-_jdk17_x86_64 1 0 0
org.apache.cassandra.cql3.NonNativeTimestampTest-cdc_jdk11_x86_64 1 0 0
org.apache.cassandra.cql3.NonNativeTimestampTest-cdc_jdk17_x86_64 1 0 0
org.apache.cassandra.cql3.NonNativeTimestampTest-compression_jdk11_x86_64 1 0 0
org.apache.cassandra.cql3.NonNativeTimestampTest-compression_jdk17_x86_64 1 0 0
org.apache.cassandra.cql3.NonNativeTimestampTest-latest_jdk11_x86_64 1 0 0
org.apache.cassandra.cql3.NonNativeTimestampTest-latest_jdk17_x86_64 1 0 0
org.apache.cassandra.cql3.NonNativeTimestampTest-oa_jdk11_x86_64 1 0 0
org.apache.cassandra.cql3.NonNativeTimestampTest-oa_jdk17_x86_64 1 0 0
org.apache.cassandra.cql3.NonNativeTimestampTest-system_keyspace_directory_jdk11_x86_64 1 0 0
org.apache.cassandra.cql3.NonNativeTimestampTest-system_keyspace_directory_jdk17_x86_64 1 0 0
org.apache.cassandra.cql3.OutOfSpaceTest-_jdk11_x86_64 3 0 0
org.apache.cassandra.cql3.OutOfSpaceTest-_jdk17_x86_64 3 0 0
org.apache.cassandra.cql3.OutOfSpaceTest-cdc_jdk11_x86_64 3 0 0
org.apache.cassandra.cql3.OutOfSpaceTest-cdc_jdk17_x86_64 3 0 0
org.apache.cassandra.cql3.OutOfSpaceTest-compression_jdk11_x86_64 3 0 0
org.apache.cassandra.cql3.OutOfSpaceTest-compression_jdk17_x86_64 3 0 0
org.apache.cassandra.cql3.OutOfSpaceTest-latest_jdk11_x86_64 3 0 0
org.apache.cassandra.cql3.OutOfSpaceTest-latest_jdk17_x86_64 3 0 0
org.apache.cassandra.cql3.OutOfSpaceTest-oa_jdk11_x86_64 3 0 0
org.apache.cassandra.cql3.OutOfSpaceTest-oa_jdk17_x86_64 3 0 0
org.apache.cassandra.cql3.OutOfSpaceTest-system_keyspace_directory_jdk11_x86_64 3 0 0
org.apache.cassandra.cql3.OutOfSpaceTest-system_keyspace_directory_jdk17_x86_64 3 0 0
org.apache.cassandra.cql3.PagingQueryTest-_jdk11_x86_64 1 0 0
org.apache.cassandra.cql3.PagingQueryTest-_jdk17_x86_64 1 0 0
org.apache.cassandra.cql3.PagingQueryTest-cdc_jdk11_x86_64 1 0 0
org.apache.cassandra.cql3.PagingQueryTest-cdc_jdk17_x86_64 1 0 0
org.apache.cassandra.cql3.PagingQueryTest-compression_jdk11_x86_64 1 0 0
org.apache.cassandra.cql3.PagingQueryTest-compression_jdk17_x86_64 1 0 0
org.apache.cassandra.cql3.PagingQueryTest-latest_jdk11_x86_64 1 0 0
org.apache.cassandra.cql3.PagingQueryTest-latest_jdk17_x86_64 1 0 0
org.apache.cassandra.cql3.PagingQueryTest-oa_jdk11_x86_64 1 0 0
org.apache.cassandra.cql3.PagingQueryTest-oa_jdk17_x86_64 1 0 0
org.apache.cassandra.cql3.PagingQueryTest-system_keyspace_directory_jdk11_x86_64 1 0 0
org.apache.cassandra.cql3.PagingQueryTest-system_keyspace_directory_jdk17_x86_64 1 0 0
org.apache.cassandra.cql3.PagingTest-_jdk11_x86_64 1 0 0
org.apache.cassandra.cql3.PagingTest-_jdk17_x86_64 1 0 0
org.apache.cassandra.cql3.PagingTest-cdc_jdk11_x86_64 1 0 0
org.apache.cassandra.cql3.PagingTest-cdc_jdk17_x86_64 1 0 0
org.apache.cassandra.cql3.PagingTest-compression_jdk11_x86_64 1 0 0
org.apache.cassandra.cql3.PagingTest-compression_jdk17_x86_64 1 0 0
org.apache.cassandra.cql3.PagingTest-latest_jdk11_x86_64 1 0 0
org.apache.cassandra.cql3.PagingTest-latest_jdk17_x86_64 1 0 0
org.apache.cassandra.cql3.PagingTest-oa_jdk11_x86_64 1 0 0
org.apache.cassandra.cql3.PagingTest-oa_jdk17_x86_64 1 0 0
org.apache.cassandra.cql3.PagingTest-system_keyspace_directory_jdk11_x86_64 1 0 0
org.apache.cassandra.cql3.PagingTest-system_keyspace_directory_jdk17_x86_64 1 0 0
org.apache.cassandra.cql3.PasswordObfuscatorTest-_jdk11_x86_64 19 0 0
org.apache.cassandra.cql3.PasswordObfuscatorTest-_jdk17_x86_64 19 0 0
org.apache.cassandra.cql3.PasswordObfuscatorTest-cdc_jdk11_x86_64 19 0 0
org.apache.cassandra.cql3.PasswordObfuscatorTest-cdc_jdk17_x86_64 19 0 0
org.apache.cassandra.cql3.PasswordObfuscatorTest-compression_jdk11_x86_64 19 0 0
org.apache.cassandra.cql3.PasswordObfuscatorTest-compression_jdk17_x86_64 19 0 0
org.apache.cassandra.cql3.PasswordObfuscatorTest-latest_jdk11_x86_64 19 0 0
org.apache.cassandra.cql3.PasswordObfuscatorTest-latest_jdk17_x86_64 19 0 0
org.apache.cassandra.cql3.PasswordObfuscatorTest-oa_jdk11_x86_64 19 0 0
org.apache.cassandra.cql3.PasswordObfuscatorTest-oa_jdk17_x86_64 19 0 0
org.apache.cassandra.cql3.PasswordObfuscatorTest-system_keyspace_directory_jdk11_x86_64 19 0 0
org.apache.cassandra.cql3.PasswordObfuscatorTest-system_keyspace_directory_jdk17_x86_64 19 0 0
org.apache.cassandra.cql3.PreparedStatementsTest-_jdk11_x86_64 10 0 0
org.apache.cassandra.cql3.PreparedStatementsTest-_jdk17_x86_64 10 0 0
org.apache.cassandra.cql3.PreparedStatementsTest-cdc_jdk11_x86_64 10 0 0
org.apache.cassandra.cql3.PreparedStatementsTest-cdc_jdk17_x86_64 10 0 0
org.apache.cassandra.cql3.PreparedStatementsTest-compression_jdk11_x86_64 10 0 0
org.apache.cassandra.cql3.PreparedStatementsTest-compression_jdk17_x86_64 10 0 0
org.apache.cassandra.cql3.PreparedStatementsTest-latest_jdk11_x86_64 10 0 0
org.apache.cassandra.cql3.PreparedStatementsTest-latest_jdk17_x86_64 10 0 0
org.apache.cassandra.cql3.PreparedStatementsTest-oa_jdk11_x86_64 10 0 0
org.apache.cassandra.cql3.PreparedStatementsTest-oa_jdk17_x86_64 10 0 0
org.apache.cassandra.cql3.PreparedStatementsTest-system_keyspace_directory_jdk11_x86_64 10 0 0
org.apache.cassandra.cql3.PreparedStatementsTest-system_keyspace_directory_jdk17_x86_64 10 0 0
org.apache.cassandra.cql3.PstmtPersistenceTest-_jdk11_x86_64 2 0 0
org.apache.cassandra.cql3.PstmtPersistenceTest-_jdk17_x86_64 2 0 0
org.apache.cassandra.cql3.PstmtPersistenceTest-cdc_jdk11_x86_64 2 0 0
org.apache.cassandra.cql3.PstmtPersistenceTest-cdc_jdk17_x86_64 2 0 0
org.apache.cassandra.cql3.PstmtPersistenceTest-compression_jdk11_x86_64 2 0 0
org.apache.cassandra.cql3.PstmtPersistenceTest-compression_jdk17_x86_64 2 0 0
org.apache.cassandra.cql3.PstmtPersistenceTest-latest_jdk11_x86_64 2 0 0
org.apache.cassandra.cql3.PstmtPersistenceTest-latest_jdk17_x86_64 2 0 0
org.apache.cassandra.cql3.PstmtPersistenceTest-oa_jdk11_x86_64 2 0 0
org.apache.cassandra.cql3.PstmtPersistenceTest-oa_jdk17_x86_64 2 0 0
org.apache.cassandra.cql3.PstmtPersistenceTest-system_keyspace_directory_jdk11_x86_64 2 0 0
org.apache.cassandra.cql3.PstmtPersistenceTest-system_keyspace_directory_jdk17_x86_64 2 0 0
org.apache.cassandra.cql3.QueryEventsTest-_jdk11_x86_64 4 0 0
org.apache.cassandra.cql3.QueryEventsTest-_jdk17_x86_64 4 0 0
org.apache.cassandra.cql3.QueryEventsTest-cdc_jdk11_x86_64 4 0 0
org.apache.cassandra.cql3.QueryEventsTest-cdc_jdk17_x86_64 4 0 0
org.apache.cassandra.cql3.QueryEventsTest-compression_jdk11_x86_64 4 0 0
org.apache.cassandra.cql3.QueryEventsTest-compression_jdk17_x86_64 4 0 0
org.apache.cassandra.cql3.QueryEventsTest-latest_jdk11_x86_64 4 0 0
org.apache.cassandra.cql3.QueryEventsTest-latest_jdk17_x86_64 4 0 0
org.apache.cassandra.cql3.QueryEventsTest-oa_jdk11_x86_64 4 0 0
org.apache.cassandra.cql3.QueryEventsTest-oa_jdk17_x86_64 4 0 0
org.apache.cassandra.cql3.QueryEventsTest-system_keyspace_directory_jdk11_x86_64 4 0 0
org.apache.cassandra.cql3.QueryEventsTest-system_keyspace_directory_jdk17_x86_64 4 0 0
org.apache.cassandra.cql3.QueryWithIndexedSSTableTest-_jdk11_x86_64 1 0 0
org.apache.cassandra.cql3.QueryWithIndexedSSTableTest-_jdk17_x86_64 1 0 0
org.apache.cassandra.cql3.QueryWithIndexedSSTableTest-cdc_jdk11_x86_64 1 0 0
org.apache.cassandra.cql3.QueryWithIndexedSSTableTest-cdc_jdk17_x86_64 1 0 0
org.apache.cassandra.cql3.QueryWithIndexedSSTableTest-compression_jdk11_x86_64 1 0 0
org.apache.cassandra.cql3.QueryWithIndexedSSTableTest-compression_jdk17_x86_64 1 0 0
org.apache.cassandra.cql3.QueryWithIndexedSSTableTest-latest_jdk11_x86_64 1 0 0
org.apache.cassandra.cql3.QueryWithIndexedSSTableTest-latest_jdk17_x86_64 1 0 0
org.apache.cassandra.cql3.QueryWithIndexedSSTableTest-oa_jdk11_x86_64 1 0 0
org.apache.cassandra.cql3.QueryWithIndexedSSTableTest-oa_jdk17_x86_64 1 0 0
org.apache.cassandra.cql3.QueryWithIndexedSSTableTest-system_keyspace_directory_jdk11_x86_64 1 0 0
org.apache.cassandra.cql3.QueryWithIndexedSSTableTest-system_keyspace_directory_jdk17_x86_64 1 0 0
org.apache.cassandra.cql3.RandomSchemaTest-_jdk11_x86_64 1 0 0
org.apache.cassandra.cql3.RandomSchemaTest-_jdk17_x86_64 1 0 0
org.apache.cassandra.cql3.RandomSchemaTest-cdc_jdk11_x86_64 1 0 0
org.apache.cassandra.cql3.RandomSchemaTest-cdc_jdk17_x86_64 1 0 0
org.apache.cassandra.cql3.RandomSchemaTest-compression_jdk11_x86_64 1 0 0
org.apache.cassandra.cql3.RandomSchemaTest-compression_jdk17_x86_64 1 0 0
org.apache.cassandra.cql3.RandomSchemaTest-latest_jdk11_x86_64 1 0 0
org.apache.cassandra.cql3.RandomSchemaTest-latest_jdk17_x86_64 1 0 0
org.apache.cassandra.cql3.RandomSchemaTest-oa_jdk11_x86_64 1 0 0
org.apache.cassandra.cql3.RandomSchemaTest-oa_jdk17_x86_64 1 0 0
org.apache.cassandra.cql3.RandomSchemaTest-system_keyspace_directory_jdk11_x86_64 1 0 0
org.apache.cassandra.cql3.RandomSchemaTest-system_keyspace_directory_jdk17_x86_64 1 0 0
org.apache.cassandra.cql3.RelationTest-_jdk11_x86_64 1 0 0
org.apache.cassandra.cql3.RelationTest-_jdk17_x86_64 1 0 0
org.apache.cassandra.cql3.RelationTest-cdc_jdk11_x86_64 1 0 0
org.apache.cassandra.cql3.RelationTest-cdc_jdk17_x86_64 1 0 0
org.apache.cassandra.cql3.RelationTest-compression_jdk11_x86_64 1 0 0
org.apache.cassandra.cql3.RelationTest-compression_jdk17_x86_64 1 0 0
org.apache.cassandra.cql3.RelationTest-latest_jdk11_x86_64 1 0 0
org.apache.cassandra.cql3.RelationTest-latest_jdk17_x86_64 1 0 0
org.apache.cassandra.cql3.RelationTest-oa_jdk11_x86_64 1 0 0
org.apache.cassandra.cql3.RelationTest-oa_jdk17_x86_64 1 0 0
org.apache.cassandra.cql3.RelationTest-system_keyspace_directory_jdk11_x86_64 1 0 0
org.apache.cassandra.cql3.RelationTest-system_keyspace_directory_jdk17_x86_64 1 0 0
org.apache.cassandra.cql3.ReservedKeywordsTest-_jdk11_x86_64 1 0 0
org.apache.cassandra.cql3.ReservedKeywordsTest-_jdk17_x86_64 1 0 0
org.apache.cassandra.cql3.ReservedKeywordsTest-cdc_jdk11_x86_64 1 0 0
org.apache.cassandra.cql3.ReservedKeywordsTest-cdc_jdk17_x86_64 1 0 0
org.apache.cassandra.cql3.ReservedKeywordsTest-compression_jdk11_x86_64 1 0 0
org.apache.cassandra.cql3.ReservedKeywordsTest-compression_jdk17_x86_64 1 0 0
org.apache.cassandra.cql3.ReservedKeywordsTest-latest_jdk11_x86_64 1 0 0
org.apache.cassandra.cql3.ReservedKeywordsTest-latest_jdk17_x86_64 1 0 0
org.apache.cassandra.cql3.ReservedKeywordsTest-oa_jdk11_x86_64 1 0 0
org.apache.cassandra.cql3.ReservedKeywordsTest-oa_jdk17_x86_64 1 0 0
org.apache.cassandra.cql3.ReservedKeywordsTest-system_keyspace_directory_jdk11_x86_64 1 0 0
org.apache.cassandra.cql3.ReservedKeywordsTest-system_keyspace_directory_jdk17_x86_64 1 0 0
org.apache.cassandra.cql3.SecondaryIndexSSTableExportTest-_jdk11_x86_64 8 0 0
org.apache.cassandra.cql3.SecondaryIndexSSTableExportTest-_jdk17_x86_64 8 0 0
org.apache.cassandra.cql3.SecondaryIndexSSTableExportTest-cdc_jdk11_x86_64 8 0 0
org.apache.cassandra.cql3.SecondaryIndexSSTableExportTest-cdc_jdk17_x86_64 8 0 0
org.apache.cassandra.cql3.SecondaryIndexSSTableExportTest-compression_jdk11_x86_64 8 0 0
org.apache.cassandra.cql3.SecondaryIndexSSTableExportTest-compression_jdk17_x86_64 8 0 0
org.apache.cassandra.cql3.SecondaryIndexSSTableExportTest-latest_jdk11_x86_64 8 0 0
org.apache.cassandra.cql3.SecondaryIndexSSTableExportTest-latest_jdk17_x86_64 8 0 0
org.apache.cassandra.cql3.SecondaryIndexSSTableExportTest-oa_jdk11_x86_64 8 0 0
org.apache.cassandra.cql3.SecondaryIndexSSTableExportTest-oa_jdk17_x86_64 8 0 0
org.apache.cassandra.cql3.SecondaryIndexSSTableExportTest-system_keyspace_directory_jdk11_x86_64 8 0 0
org.apache.cassandra.cql3.SecondaryIndexSSTableExportTest-system_keyspace_directory_jdk17_x86_64 8 0 0
org.apache.cassandra.cql3.SerializationMirrorTest-_jdk11_x86_64 1 0 0
org.apache.cassandra.cql3.SerializationMirrorTest-_jdk17_x86_64 1 0 0
org.apache.cassandra.cql3.SerializationMirrorTest-cdc_jdk11_x86_64 1 0 0
org.apache.cassandra.cql3.SerializationMirrorTest-cdc_jdk17_x86_64 1 0 0
org.apache.cassandra.cql3.SerializationMirrorTest-compression_jdk11_x86_64 1 0 0
org.apache.cassandra.cql3.SerializationMirrorTest-compression_jdk17_x86_64 1 0 0
org.apache.cassandra.cql3.SerializationMirrorTest-latest_jdk11_x86_64 1 0 0
org.apache.cassandra.cql3.SerializationMirrorTest-latest_jdk17_x86_64 1 0 0
org.apache.cassandra.cql3.SerializationMirrorTest-oa_jdk11_x86_64 1 0 0
org.apache.cassandra.cql3.SerializationMirrorTest-oa_jdk17_x86_64 1 0 0
org.apache.cassandra.cql3.SerializationMirrorTest-system_keyspace_directory_jdk11_x86_64 1 0 0
org.apache.cassandra.cql3.SerializationMirrorTest-system_keyspace_directory_jdk17_x86_64 1 0 0
org.apache.cassandra.cql3.SimpleQueryTest-_jdk11_x86_64 18 0 0
org.apache.cassandra.cql3.SimpleQueryTest-_jdk17_x86_64 18 0 0
org.apache.cassandra.cql3.SimpleQueryTest-cdc_jdk11_x86_64 18 0 0
org.apache.cassandra.cql3.SimpleQueryTest-cdc_jdk17_x86_64 18 0 0
org.apache.cassandra.cql3.SimpleQueryTest-compression_jdk11_x86_64 18 0 0
org.apache.cassandra.cql3.SimpleQueryTest-compression_jdk17_x86_64 18 0 0
org.apache.cassandra.cql3.SimpleQueryTest-latest_jdk11_x86_64 18 0 0
org.apache.cassandra.cql3.SimpleQueryTest-latest_jdk17_x86_64 18 0 0
org.apache.cassandra.cql3.SimpleQueryTest-oa_jdk11_x86_64 18 0 0
org.apache.cassandra.cql3.SimpleQueryTest-oa_jdk17_x86_64 18 0 0
org.apache.cassandra.cql3.SimpleQueryTest-system_keyspace_directory_jdk11_x86_64 18 0 0
org.apache.cassandra.cql3.SimpleQueryTest-system_keyspace_directory_jdk17_x86_64 18 0 0
org.apache.cassandra.cql3.SystemKeyspaceTablesNamesTest-_jdk11_x86_64 5 0 0
org.apache.cassandra.cql3.SystemKeyspaceTablesNamesTest-_jdk17_x86_64 5 0 0
org.apache.cassandra.cql3.SystemKeyspaceTablesNamesTest-cdc_jdk11_x86_64 5 0 0
org.apache.cassandra.cql3.SystemKeyspaceTablesNamesTest-cdc_jdk17_x86_64 5 0 0
org.apache.cassandra.cql3.SystemKeyspaceTablesNamesTest-compression_jdk11_x86_64 5 0 0
org.apache.cassandra.cql3.SystemKeyspaceTablesNamesTest-compression_jdk17_x86_64 5 0 0
org.apache.cassandra.cql3.SystemKeyspaceTablesNamesTest-latest_jdk11_x86_64 5 0 0
org.apache.cassandra.cql3.SystemKeyspaceTablesNamesTest-latest_jdk17_x86_64 5 0 0
org.apache.cassandra.cql3.SystemKeyspaceTablesNamesTest-oa_jdk11_x86_64 5 0 0
org.apache.cassandra.cql3.SystemKeyspaceTablesNamesTest-oa_jdk17_x86_64 5 0 0
org.apache.cassandra.cql3.SystemKeyspaceTablesNamesTest-system_keyspace_directory_jdk11_x86_64 5 0 0
org.apache.cassandra.cql3.SystemKeyspaceTablesNamesTest-system_keyspace_directory_jdk17_x86_64 5 0 0
org.apache.cassandra.cql3.TombstonesWithIndexedSSTableTest-_jdk11_x86_64 4 0 0
org.apache.cassandra.cql3.TombstonesWithIndexedSSTableTest-_jdk17_x86_64 4 0 0
org.apache.cassandra.cql3.TombstonesWithIndexedSSTableTest-cdc_jdk11_x86_64 4 0 0
org.apache.cassandra.cql3.TombstonesWithIndexedSSTableTest-cdc_jdk17_x86_64 4 0 0
org.apache.cassandra.cql3.TombstonesWithIndexedSSTableTest-compression_jdk11_x86_64 4 0 0
org.apache.cassandra.cql3.TombstonesWithIndexedSSTableTest-compression_jdk17_x86_64 4 0 0
org.apache.cassandra.cql3.TombstonesWithIndexedSSTableTest-latest_jdk11_x86_64 1 0 3
org.apache.cassandra.cql3.TombstonesWithIndexedSSTableTest-latest_jdk17_x86_64 1 0 3
org.apache.cassandra.cql3.TombstonesWithIndexedSSTableTest-oa_jdk11_x86_64 4 0 0
org.apache.cassandra.cql3.TombstonesWithIndexedSSTableTest-oa_jdk17_x86_64 4 0 0
org.apache.cassandra.cql3.TombstonesWithIndexedSSTableTest-system_keyspace_directory_jdk11_x86_64 4 0 0
org.apache.cassandra.cql3.TombstonesWithIndexedSSTableTest-system_keyspace_directory_jdk17_x86_64 4 0 0
org.apache.cassandra.cql3.TraceCqlTest-_jdk11_x86_64 1 0 0
org.apache.cassandra.cql3.TraceCqlTest-_jdk17_x86_64 1 0 0
org.apache.cassandra.cql3.TraceCqlTest-cdc_jdk11_x86_64 1 0 0
org.apache.cassandra.cql3.TraceCqlTest-cdc_jdk17_x86_64 1 0 0
org.apache.cassandra.cql3.TraceCqlTest-compression_jdk11_x86_64 1 0 0
org.apache.cassandra.cql3.TraceCqlTest-compression_jdk17_x86_64 1 0 0
org.apache.cassandra.cql3.TraceCqlTest-latest_jdk11_x86_64 1 0 0
org.apache.cassandra.cql3.TraceCqlTest-latest_jdk17_x86_64 1 0 0
org.apache.cassandra.cql3.TraceCqlTest-oa_jdk11_x86_64 1 0 0
org.apache.cassandra.cql3.TraceCqlTest-oa_jdk17_x86_64 1 0 0
org.apache.cassandra.cql3.TraceCqlTest-system_keyspace_directory_jdk11_x86_64 1 0 0
org.apache.cassandra.cql3.TraceCqlTest-system_keyspace_directory_jdk17_x86_64 1 0 0
org.apache.cassandra.cql3.ViewAbstractParameterizedTest-_jdk11_x86_64 0 0 1
org.apache.cassandra.cql3.ViewAbstractParameterizedTest-_jdk17_x86_64 0 0 1
org.apache.cassandra.cql3.ViewAbstractParameterizedTest-cdc_jdk11_x86_64 0 0 1
org.apache.cassandra.cql3.ViewAbstractParameterizedTest-cdc_jdk17_x86_64 0 0 1
org.apache.cassandra.cql3.ViewAbstractParameterizedTest-compression_jdk11_x86_64 0 0 1
org.apache.cassandra.cql3.ViewAbstractParameterizedTest-compression_jdk17_x86_64 0 0 1
org.apache.cassandra.cql3.ViewAbstractParameterizedTest-latest_jdk11_x86_64 0 0 1
org.apache.cassandra.cql3.ViewAbstractParameterizedTest-latest_jdk17_x86_64 0 0 1
org.apache.cassandra.cql3.ViewAbstractParameterizedTest-oa_jdk11_x86_64 0 0 1
org.apache.cassandra.cql3.ViewAbstractParameterizedTest-oa_jdk17_x86_64 0 0 1
org.apache.cassandra.cql3.ViewAbstractParameterizedTest-system_keyspace_directory_jdk11_x86_64 0 0 1
org.apache.cassandra.cql3.ViewAbstractParameterizedTest-system_keyspace_directory_jdk17_x86_64 0 0 1
org.apache.cassandra.cql3.ViewAbstractTest-_jdk11_x86_64 0 0 1
org.apache.cassandra.cql3.ViewAbstractTest-_jdk17_x86_64 0 0 1
org.apache.cassandra.cql3.ViewAbstractTest-cdc_jdk11_x86_64 0 0 1
org.apache.cassandra.cql3.ViewAbstractTest-cdc_jdk17_x86_64 0 0 1
org.apache.cassandra.cql3.ViewAbstractTest-compression_jdk11_x86_64 0 0 1
org.apache.cassandra.cql3.ViewAbstractTest-compression_jdk17_x86_64 0 0 1
org.apache.cassandra.cql3.ViewAbstractTest-latest_jdk11_x86_64 0 0 1
org.apache.cassandra.cql3.ViewAbstractTest-latest_jdk17_x86_64 0 0 1
org.apache.cassandra.cql3.ViewAbstractTest-oa_jdk11_x86_64 0 0 1
org.apache.cassandra.cql3.ViewAbstractTest-oa_jdk17_x86_64 0 0 1
org.apache.cassandra.cql3.ViewAbstractTest-system_keyspace_directory_jdk11_x86_64 0 0 1
org.apache.cassandra.cql3.ViewAbstractTest-system_keyspace_directory_jdk17_x86_64 0 0 1
org.apache.cassandra.cql3.ViewComplexDeletionsPartialTest-_jdk11_x86_64 16 0 8
org.apache.cassandra.cql3.ViewComplexDeletionsPartialTest-_jdk17_x86_64 16 0 8
org.apache.cassandra.cql3.ViewComplexDeletionsPartialTest-cdc_jdk11_x86_64 16 0 8
org.apache.cassandra.cql3.ViewComplexDeletionsPartialTest-cdc_jdk17_x86_64 16 0 8
org.apache.cassandra.cql3.ViewComplexDeletionsPartialTest-compression_jdk11_x86_64 16 0 8
org.apache.cassandra.cql3.ViewComplexDeletionsPartialTest-compression_jdk17_x86_64 16 0 8
org.apache.cassandra.cql3.ViewComplexDeletionsPartialTest-latest_jdk11_x86_64 16 0 8
org.apache.cassandra.cql3.ViewComplexDeletionsPartialTest-latest_jdk17_x86_64 16 0 8
org.apache.cassandra.cql3.ViewComplexDeletionsPartialTest-oa_jdk11_x86_64 16 0 8
org.apache.cassandra.cql3.ViewComplexDeletionsPartialTest-oa_jdk17_x86_64 16 0 8
org.apache.cassandra.cql3.ViewComplexDeletionsPartialTest-system_keyspace_directory_jdk11_x86_64 16 0 8
org.apache.cassandra.cql3.ViewComplexDeletionsPartialTest-system_keyspace_directory_jdk17_x86_64 16 0 8
org.apache.cassandra.cql3.ViewComplexDeletionsTest-_jdk11_x86_64 20 0 0
org.apache.cassandra.cql3.ViewComplexDeletionsTest-_jdk17_x86_64 20 0 0
org.apache.cassandra.cql3.ViewComplexDeletionsTest-cdc_jdk11_x86_64 20 0 0
org.apache.cassandra.cql3.ViewComplexDeletionsTest-cdc_jdk17_x86_64 20 0 0
org.apache.cassandra.cql3.ViewComplexDeletionsTest-compression_jdk11_x86_64 20 0 0
org.apache.cassandra.cql3.ViewComplexDeletionsTest-compression_jdk17_x86_64 20 0 0
org.apache.cassandra.cql3.ViewComplexDeletionsTest-latest_jdk11_x86_64 20 0 0
org.apache.cassandra.cql3.ViewComplexDeletionsTest-latest_jdk17_x86_64 20 0 0
org.apache.cassandra.cql3.ViewComplexDeletionsTest-oa_jdk11_x86_64 20 0 0
org.apache.cassandra.cql3.ViewComplexDeletionsTest-oa_jdk17_x86_64 20 0 0
org.apache.cassandra.cql3.ViewComplexDeletionsTest-system_keyspace_directory_jdk11_x86_64 20 0 0
org.apache.cassandra.cql3.ViewComplexDeletionsTest-system_keyspace_directory_jdk17_x86_64 20 0 0
org.apache.cassandra.cql3.ViewComplexLivenessLimitTest-_jdk11_x86_64 8 0 0
org.apache.cassandra.cql3.ViewComplexLivenessLimitTest-_jdk17_x86_64 8 0 0
org.apache.cassandra.cql3.ViewComplexLivenessLimitTest-cdc_jdk11_x86_64 8 0 0
org.apache.cassandra.cql3.ViewComplexLivenessLimitTest-cdc_jdk17_x86_64 8 0 0
org.apache.cassandra.cql3.ViewComplexLivenessLimitTest-compression_jdk11_x86_64 8 0 0
org.apache.cassandra.cql3.ViewComplexLivenessLimitTest-compression_jdk17_x86_64 8 0 0
org.apache.cassandra.cql3.ViewComplexLivenessLimitTest-latest_jdk11_x86_64 8 0 0
org.apache.cassandra.cql3.ViewComplexLivenessLimitTest-latest_jdk17_x86_64 8 0 0
org.apache.cassandra.cql3.ViewComplexLivenessLimitTest-oa_jdk11_x86_64 8 0 0
org.apache.cassandra.cql3.ViewComplexLivenessLimitTest-oa_jdk17_x86_64 8 0 0
org.apache.cassandra.cql3.ViewComplexLivenessLimitTest-system_keyspace_directory_jdk11_x86_64 8 0 0
org.apache.cassandra.cql3.ViewComplexLivenessLimitTest-system_keyspace_directory_jdk17_x86_64 8 0 0
org.apache.cassandra.cql3.ViewComplexLivenessTest-_jdk11_x86_64 12 0 0
org.apache.cassandra.cql3.ViewComplexLivenessTest-_jdk17_x86_64 12 0 0
org.apache.cassandra.cql3.ViewComplexLivenessTest-cdc_jdk11_x86_64 12 0 0
org.apache.cassandra.cql3.ViewComplexLivenessTest-cdc_jdk17_x86_64 12 0 0
org.apache.cassandra.cql3.ViewComplexLivenessTest-compression_jdk11_x86_64 12 0 0
org.apache.cassandra.cql3.ViewComplexLivenessTest-compression_jdk17_x86_64 12 0 0
org.apache.cassandra.cql3.ViewComplexLivenessTest-latest_jdk11_x86_64 12 0 0
org.apache.cassandra.cql3.ViewComplexLivenessTest-latest_jdk17_x86_64 12 0 0
org.apache.cassandra.cql3.ViewComplexLivenessTest-oa_jdk11_x86_64 12 0 0
org.apache.cassandra.cql3.ViewComplexLivenessTest-oa_jdk17_x86_64 12 0 0
org.apache.cassandra.cql3.ViewComplexLivenessTest-system_keyspace_directory_jdk11_x86_64 12 0 0
org.apache.cassandra.cql3.ViewComplexLivenessTest-system_keyspace_directory_jdk17_x86_64 12 0 0
org.apache.cassandra.cql3.ViewComplexTTLTest-_jdk11_x86_64 20 0 0
org.apache.cassandra.cql3.ViewComplexTTLTest-_jdk17_x86_64 20 0 0
org.apache.cassandra.cql3.ViewComplexTTLTest-cdc_jdk11_x86_64 20 0 0
org.apache.cassandra.cql3.ViewComplexTTLTest-cdc_jdk17_x86_64 20 0 0
org.apache.cassandra.cql3.ViewComplexTTLTest-compression_jdk11_x86_64 20 0 0
org.apache.cassandra.cql3.ViewComplexTTLTest-compression_jdk17_x86_64 20 0 0
org.apache.cassandra.cql3.ViewComplexTTLTest-latest_jdk11_x86_64 20 0 0
org.apache.cassandra.cql3.ViewComplexTTLTest-latest_jdk17_x86_64 20 0 0
org.apache.cassandra.cql3.ViewComplexTTLTest-oa_jdk11_x86_64 20 0 0
org.apache.cassandra.cql3.ViewComplexTTLTest-oa_jdk17_x86_64 20 0 0
org.apache.cassandra.cql3.ViewComplexTTLTest-system_keyspace_directory_jdk11_x86_64 20 0 0
org.apache.cassandra.cql3.ViewComplexTTLTest-system_keyspace_directory_jdk17_x86_64 20 0 0
org.apache.cassandra.cql3.ViewComplexTest-_jdk11_x86_64 16 0 0
org.apache.cassandra.cql3.ViewComplexTest-_jdk17_x86_64 16 0 0
org.apache.cassandra.cql3.ViewComplexTest-cdc_jdk11_x86_64 16 0 0
org.apache.cassandra.cql3.ViewComplexTest-cdc_jdk17_x86_64 16 0 0
org.apache.cassandra.cql3.ViewComplexTest-compression_jdk11_x86_64 16 0 0
org.apache.cassandra.cql3.ViewComplexTest-compression_jdk17_x86_64 16 0 0
org.apache.cassandra.cql3.ViewComplexTest-latest_jdk11_x86_64 16 0 0
org.apache.cassandra.cql3.ViewComplexTest-latest_jdk17_x86_64 16 0 0
org.apache.cassandra.cql3.ViewComplexTest-oa_jdk11_x86_64 16 0 0
org.apache.cassandra.cql3.ViewComplexTest-oa_jdk17_x86_64 16 0 0
org.apache.cassandra.cql3.ViewComplexTest-system_keyspace_directory_jdk11_x86_64 16 0 0
org.apache.cassandra.cql3.ViewComplexTest-system_keyspace_directory_jdk17_x86_64 16 0 0
org.apache.cassandra.cql3.ViewComplexTombstoneTest-_jdk11_x86_64 8 0 0
org.apache.cassandra.cql3.ViewComplexTombstoneTest-_jdk17_x86_64 8 0 0
org.apache.cassandra.cql3.ViewComplexTombstoneTest-cdc_jdk11_x86_64 8 0 0
org.apache.cassandra.cql3.ViewComplexTombstoneTest-cdc_jdk17_x86_64 8 0 0
org.apache.cassandra.cql3.ViewComplexTombstoneTest-compression_jdk11_x86_64 8 0 0
org.apache.cassandra.cql3.ViewComplexTombstoneTest-compression_jdk17_x86_64 8 0 0
org.apache.cassandra.cql3.ViewComplexTombstoneTest-latest_jdk11_x86_64 8 0 0
org.apache.cassandra.cql3.ViewComplexTombstoneTest-latest_jdk17_x86_64 8 0 0
org.apache.cassandra.cql3.ViewComplexTombstoneTest-oa_jdk11_x86_64 8 0 0
org.apache.cassandra.cql3.ViewComplexTombstoneTest-oa_jdk17_x86_64 8 0 0
org.apache.cassandra.cql3.ViewComplexTombstoneTest-system_keyspace_directory_jdk11_x86_64 8 0 0
org.apache.cassandra.cql3.ViewComplexTombstoneTest-system_keyspace_directory_jdk17_x86_64 8 0 0
org.apache.cassandra.cql3.ViewComplexUpdatesTest-_jdk11_x86_64 32 0 0
org.apache.cassandra.cql3.ViewComplexUpdatesTest-_jdk17_x86_64 32 0 0
org.apache.cassandra.cql3.ViewComplexUpdatesTest-cdc_jdk11_x86_64 32 0 0
org.apache.cassandra.cql3.ViewComplexUpdatesTest-cdc_jdk17_x86_64 32 0 0
org.apache.cassandra.cql3.ViewComplexUpdatesTest-compression_jdk11_x86_64 32 0 0
org.apache.cassandra.cql3.ViewComplexUpdatesTest-compression_jdk17_x86_64 32 0 0
org.apache.cassandra.cql3.ViewComplexUpdatesTest-latest_jdk11_x86_64 32 0 0
org.apache.cassandra.cql3.ViewComplexUpdatesTest-latest_jdk17_x86_64 32 0 0
org.apache.cassandra.cql3.ViewComplexUpdatesTest-oa_jdk11_x86_64 32 0 0
org.apache.cassandra.cql3.ViewComplexUpdatesTest-oa_jdk17_x86_64 32 0 0
org.apache.cassandra.cql3.ViewComplexUpdatesTest-system_keyspace_directory_jdk11_x86_64 32 0 0
org.apache.cassandra.cql3.ViewComplexUpdatesTest-system_keyspace_directory_jdk17_x86_64 32 0 0
org.apache.cassandra.cql3.ViewFiltering1Test-_jdk11_x86_64 16 0 12
org.apache.cassandra.cql3.ViewFiltering1Test-_jdk17_x86_64 16 0 12
org.apache.cassandra.cql3.ViewFiltering1Test-cdc_jdk11_x86_64 16 0 12
org.apache.cassandra.cql3.ViewFiltering1Test-cdc_jdk17_x86_64 16 0 12
org.apache.cassandra.cql3.ViewFiltering1Test-compression_jdk11_x86_64 16 0 12
org.apache.cassandra.cql3.ViewFiltering1Test-compression_jdk17_x86_64 16 0 12
org.apache.cassandra.cql3.ViewFiltering1Test-latest_jdk11_x86_64 16 0 12
org.apache.cassandra.cql3.ViewFiltering1Test-latest_jdk17_x86_64 16 0 12
org.apache.cassandra.cql3.ViewFiltering1Test-oa_jdk11_x86_64 16 0 12
org.apache.cassandra.cql3.ViewFiltering1Test-oa_jdk17_x86_64 16 0 12
org.apache.cassandra.cql3.ViewFiltering1Test-system_keyspace_directory_jdk11_x86_64 16 0 12
org.apache.cassandra.cql3.ViewFiltering1Test-system_keyspace_directory_jdk17_x86_64 16 0 12
org.apache.cassandra.cql3.ViewFiltering2Test-_jdk11_x86_64 28 0 0
org.apache.cassandra.cql3.ViewFiltering2Test-_jdk17_x86_64 28 0 0
org.apache.cassandra.cql3.ViewFiltering2Test-cdc_jdk11_x86_64 28 0 0
org.apache.cassandra.cql3.ViewFiltering2Test-cdc_jdk17_x86_64 28 0 0
org.apache.cassandra.cql3.ViewFiltering2Test-compression_jdk11_x86_64 28 0 0
org.apache.cassandra.cql3.ViewFiltering2Test-compression_jdk17_x86_64 28 0 0
org.apache.cassandra.cql3.ViewFiltering2Test-latest_jdk11_x86_64 28 0 0
org.apache.cassandra.cql3.ViewFiltering2Test-latest_jdk17_x86_64 28 0 0
org.apache.cassandra.cql3.ViewFiltering2Test-oa_jdk11_x86_64 28 0 0
org.apache.cassandra.cql3.ViewFiltering2Test-oa_jdk17_x86_64 28 0 0
org.apache.cassandra.cql3.ViewFiltering2Test-system_keyspace_directory_jdk11_x86_64 28 0 0
org.apache.cassandra.cql3.ViewFiltering2Test-system_keyspace_directory_jdk17_x86_64 28 0 0
org.apache.cassandra.cql3.ViewFilteringClustering1Test-_jdk11_x86_64 12 0 0
org.apache.cassandra.cql3.ViewFilteringClustering1Test-_jdk17_x86_64 12 0 0
org.apache.cassandra.cql3.ViewFilteringClustering1Test-cdc_jdk11_x86_64 12 0 0
org.apache.cassandra.cql3.ViewFilteringClustering1Test-cdc_jdk17_x86_64 12 0 0
org.apache.cassandra.cql3.ViewFilteringClustering1Test-compression_jdk11_x86_64 12 0 0
org.apache.cassandra.cql3.ViewFilteringClustering1Test-compression_jdk17_x86_64 12 0 0
org.apache.cassandra.cql3.ViewFilteringClustering1Test-latest_jdk11_x86_64 12 0 0
org.apache.cassandra.cql3.ViewFilteringClustering1Test-latest_jdk17_x86_64 12 0 0
org.apache.cassandra.cql3.ViewFilteringClustering1Test-oa_jdk11_x86_64 12 0 0
org.apache.cassandra.cql3.ViewFilteringClustering1Test-oa_jdk17_x86_64 12 0 0
org.apache.cassandra.cql3.ViewFilteringClustering1Test-system_keyspace_directory_jdk11_x86_64 12 0 0
org.apache.cassandra.cql3.ViewFilteringClustering1Test-system_keyspace_directory_jdk17_x86_64 12 0 0
org.apache.cassandra.cql3.ViewFilteringClustering2Test-_jdk11_x86_64 8 0 0
org.apache.cassandra.cql3.ViewFilteringClustering2Test-_jdk17_x86_64 8 0 0
org.apache.cassandra.cql3.ViewFilteringClustering2Test-cdc_jdk11_x86_64 8 0 0
org.apache.cassandra.cql3.ViewFilteringClustering2Test-cdc_jdk17_x86_64 8 0 0
org.apache.cassandra.cql3.ViewFilteringClustering2Test-compression_jdk11_x86_64 8 0 0
org.apache.cassandra.cql3.ViewFilteringClustering2Test-compression_jdk17_x86_64 8 0 0
org.apache.cassandra.cql3.ViewFilteringClustering2Test-latest_jdk11_x86_64 8 0 0
org.apache.cassandra.cql3.ViewFilteringClustering2Test-latest_jdk17_x86_64 8 0 0
org.apache.cassandra.cql3.ViewFilteringClustering2Test-oa_jdk11_x86_64 8 0 0
org.apache.cassandra.cql3.ViewFilteringClustering2Test-oa_jdk17_x86_64 8 0 0
org.apache.cassandra.cql3.ViewFilteringClustering2Test-system_keyspace_directory_jdk11_x86_64 8 0 0
org.apache.cassandra.cql3.ViewFilteringClustering2Test-system_keyspace_directory_jdk17_x86_64 8 0 0
org.apache.cassandra.cql3.ViewFilteringComplexPKTest-_jdk11_x86_64 12 0 0
org.apache.cassandra.cql3.ViewFilteringComplexPKTest-_jdk17_x86_64 12 0 0
org.apache.cassandra.cql3.ViewFilteringComplexPKTest-cdc_jdk11_x86_64 12 0 0
org.apache.cassandra.cql3.ViewFilteringComplexPKTest-cdc_jdk17_x86_64 12 0 0
org.apache.cassandra.cql3.ViewFilteringComplexPKTest-compression_jdk11_x86_64 12 0 0
org.apache.cassandra.cql3.ViewFilteringComplexPKTest-compression_jdk17_x86_64 12 0 0
org.apache.cassandra.cql3.ViewFilteringComplexPKTest-latest_jdk11_x86_64 12 0 0
org.apache.cassandra.cql3.ViewFilteringComplexPKTest-latest_jdk17_x86_64 12 0 0
org.apache.cassandra.cql3.ViewFilteringComplexPKTest-oa_jdk11_x86_64 12 0 0
org.apache.cassandra.cql3.ViewFilteringComplexPKTest-oa_jdk17_x86_64 12 0 0
org.apache.cassandra.cql3.ViewFilteringComplexPKTest-system_keyspace_directory_jdk11_x86_64 12 0 0
org.apache.cassandra.cql3.ViewFilteringComplexPKTest-system_keyspace_directory_jdk17_x86_64 12 0 0
org.apache.cassandra.cql3.ViewFilteringSimplePKTest-_jdk11_x86_64 12 0 0
org.apache.cassandra.cql3.ViewFilteringSimplePKTest-_jdk17_x86_64 12 0 0
org.apache.cassandra.cql3.ViewFilteringSimplePKTest-cdc_jdk11_x86_64 12 0 0
org.apache.cassandra.cql3.ViewFilteringSimplePKTest-cdc_jdk17_x86_64 12 0 0
org.apache.cassandra.cql3.ViewFilteringSimplePKTest-compression_jdk11_x86_64 12 0 0
org.apache.cassandra.cql3.ViewFilteringSimplePKTest-compression_jdk17_x86_64 12 0 0
org.apache.cassandra.cql3.ViewFilteringSimplePKTest-latest_jdk11_x86_64 12 0 0
org.apache.cassandra.cql3.ViewFilteringSimplePKTest-latest_jdk17_x86_64 12 0 0
org.apache.cassandra.cql3.ViewFilteringSimplePKTest-oa_jdk11_x86_64 12 0 0
org.apache.cassandra.cql3.ViewFilteringSimplePKTest-oa_jdk17_x86_64 12 0 0
org.apache.cassandra.cql3.ViewFilteringSimplePKTest-system_keyspace_directory_jdk11_x86_64 12 0 0
org.apache.cassandra.cql3.ViewFilteringSimplePKTest-system_keyspace_directory_jdk17_x86_64 12 0 0
org.apache.cassandra.cql3.ViewLongTest-_jdk11_x86_64 20 0 0
org.apache.cassandra.cql3.ViewLongTest-_jdk17_x86_64 20 0 0
org.apache.cassandra.cql3.ViewPKTest-_jdk11_x86_64 12 0 0
org.apache.cassandra.cql3.ViewPKTest-_jdk17_x86_64 12 0 0
org.apache.cassandra.cql3.ViewPKTest-cdc_jdk11_x86_64 12 0 0
org.apache.cassandra.cql3.ViewPKTest-cdc_jdk17_x86_64 12 0 0
org.apache.cassandra.cql3.ViewPKTest-compression_jdk11_x86_64 12 0 0
org.apache.cassandra.cql3.ViewPKTest-compression_jdk17_x86_64 12 0 0
org.apache.cassandra.cql3.ViewPKTest-latest_jdk11_x86_64 12 0 0
org.apache.cassandra.cql3.ViewPKTest-latest_jdk17_x86_64 12 0 0
org.apache.cassandra.cql3.ViewPKTest-oa_jdk11_x86_64 12 0 0
org.apache.cassandra.cql3.ViewPKTest-oa_jdk17_x86_64 12 0 0
org.apache.cassandra.cql3.ViewPKTest-system_keyspace_directory_jdk11_x86_64 12 0 0
org.apache.cassandra.cql3.ViewPKTest-system_keyspace_directory_jdk17_x86_64 12 0 0
org.apache.cassandra.cql3.ViewRangesTest-_jdk11_x86_64 5 0 0
org.apache.cassandra.cql3.ViewRangesTest-_jdk17_x86_64 5 0 0
org.apache.cassandra.cql3.ViewRangesTest-cdc_jdk11_x86_64 5 0 0
org.apache.cassandra.cql3.ViewRangesTest-cdc_jdk17_x86_64 5 0 0
org.apache.cassandra.cql3.ViewRangesTest-compression_jdk11_x86_64 5 0 0
org.apache.cassandra.cql3.ViewRangesTest-compression_jdk17_x86_64 5 0 0
org.apache.cassandra.cql3.ViewRangesTest-latest_jdk11_x86_64 5 0 0
org.apache.cassandra.cql3.ViewRangesTest-latest_jdk17_x86_64 5 0 0
org.apache.cassandra.cql3.ViewRangesTest-oa_jdk11_x86_64 5 0 0
org.apache.cassandra.cql3.ViewRangesTest-oa_jdk17_x86_64 5 0 0
org.apache.cassandra.cql3.ViewRangesTest-system_keyspace_directory_jdk11_x86_64 5 0 0
org.apache.cassandra.cql3.ViewRangesTest-system_keyspace_directory_jdk17_x86_64 5 0 0
org.apache.cassandra.cql3.ViewSchemaTest-_jdk11_x86_64 13 0 0
org.apache.cassandra.cql3.ViewSchemaTest-_jdk17_x86_64 13 0 0
org.apache.cassandra.cql3.ViewSchemaTest-cdc_jdk11_x86_64 13 0 0
org.apache.cassandra.cql3.ViewSchemaTest-cdc_jdk17_x86_64 13 0 0
org.apache.cassandra.cql3.ViewSchemaTest-compression_jdk11_x86_64 13 0 0
org.apache.cassandra.cql3.ViewSchemaTest-compression_jdk17_x86_64 13 0 0
org.apache.cassandra.cql3.ViewSchemaTest-latest_jdk11_x86_64 13 0 0
org.apache.cassandra.cql3.ViewSchemaTest-latest_jdk17_x86_64 13 0 0
org.apache.cassandra.cql3.ViewSchemaTest-oa_jdk11_x86_64 13 0 0
org.apache.cassandra.cql3.ViewSchemaTest-oa_jdk17_x86_64 13 0 0
org.apache.cassandra.cql3.ViewSchemaTest-system_keyspace_directory_jdk11_x86_64 13 0 0
org.apache.cassandra.cql3.ViewSchemaTest-system_keyspace_directory_jdk17_x86_64 13 0 0
org.apache.cassandra.cql3.ViewTest-_jdk11_x86_64 22 0 0
org.apache.cassandra.cql3.ViewTest-_jdk17_x86_64 22 0 0
org.apache.cassandra.cql3.ViewTest-cdc_jdk11_x86_64 22 0 0
org.apache.cassandra.cql3.ViewTest-cdc_jdk17_x86_64 22 0 0
org.apache.cassandra.cql3.ViewTest-compression_jdk11_x86_64 22 0 0
org.apache.cassandra.cql3.ViewTest-compression_jdk17_x86_64 22 0 0
org.apache.cassandra.cql3.ViewTest-latest_jdk11_x86_64 22 0 0
org.apache.cassandra.cql3.ViewTest-latest_jdk17_x86_64 22 0 0
org.apache.cassandra.cql3.ViewTest-oa_jdk11_x86_64 22 0 0
org.apache.cassandra.cql3.ViewTest-oa_jdk17_x86_64 22 0 0
org.apache.cassandra.cql3.ViewTest-system_keyspace_directory_jdk11_x86_64 22 0 0
org.apache.cassandra.cql3.ViewTest-system_keyspace_directory_jdk17_x86_64 22 0 0
org.apache.cassandra.cql3.ViewTimesTest-_jdk11_x86_64 10 0 0
org.apache.cassandra.cql3.ViewTimesTest-_jdk17_x86_64 10 0 0
org.apache.cassandra.cql3.ViewTimesTest-cdc_jdk11_x86_64 10 0 0
org.apache.cassandra.cql3.ViewTimesTest-cdc_jdk17_x86_64 10 0 0
org.apache.cassandra.cql3.ViewTimesTest-compression_jdk11_x86_64 10 0 0
org.apache.cassandra.cql3.ViewTimesTest-compression_jdk17_x86_64 10 0 0
org.apache.cassandra.cql3.ViewTimesTest-latest_jdk11_x86_64 10 0 0
org.apache.cassandra.cql3.ViewTimesTest-latest_jdk17_x86_64 10 0 0
org.apache.cassandra.cql3.ViewTimesTest-oa_jdk11_x86_64 10 0 0
org.apache.cassandra.cql3.ViewTimesTest-oa_jdk17_x86_64 10 0 0
org.apache.cassandra.cql3.ViewTimesTest-system_keyspace_directory_jdk11_x86_64 10 0 0
org.apache.cassandra.cql3.ViewTimesTest-system_keyspace_directory_jdk17_x86_64 10 0 0
org.apache.cassandra.cql3.conditions.ColumnConditionTest-_jdk11_x86_64 4 0 0
org.apache.cassandra.cql3.conditions.ColumnConditionTest-_jdk17_x86_64 4 0 0
org.apache.cassandra.cql3.conditions.ColumnConditionTest-cdc_jdk11_x86_64 4 0 0
org.apache.cassandra.cql3.conditions.ColumnConditionTest-cdc_jdk17_x86_64 4 0 0
org.apache.cassandra.cql3.conditions.ColumnConditionTest-compression_jdk11_x86_64 4 0 0
org.apache.cassandra.cql3.conditions.ColumnConditionTest-compression_jdk17_x86_64 4 0 0
org.apache.cassandra.cql3.conditions.ColumnConditionTest-latest_jdk11_x86_64 4 0 0
org.apache.cassandra.cql3.conditions.ColumnConditionTest-latest_jdk17_x86_64 4 0 0
org.apache.cassandra.cql3.conditions.ColumnConditionTest-oa_jdk11_x86_64 4 0 0
org.apache.cassandra.cql3.conditions.ColumnConditionTest-oa_jdk17_x86_64 4 0 0
org.apache.cassandra.cql3.conditions.ColumnConditionTest-system_keyspace_directory_jdk11_x86_64 4 0 0
org.apache.cassandra.cql3.conditions.ColumnConditionTest-system_keyspace_directory_jdk17_x86_64 4 0 0
org.apache.cassandra.cql3.functions.CastFctsTest-_jdk11_x86_64 13 0 0
org.apache.cassandra.cql3.functions.CastFctsTest-_jdk17_x86_64 13 0 0
org.apache.cassandra.cql3.functions.CastFctsTest-cdc_jdk11_x86_64 13 0 0
org.apache.cassandra.cql3.functions.CastFctsTest-cdc_jdk17_x86_64 13 0 0
org.apache.cassandra.cql3.functions.CastFctsTest-compression_jdk11_x86_64 13 0 0
org.apache.cassandra.cql3.functions.CastFctsTest-compression_jdk17_x86_64 13 0 0
org.apache.cassandra.cql3.functions.CastFctsTest-latest_jdk11_x86_64 13 0 0
org.apache.cassandra.cql3.functions.CastFctsTest-latest_jdk17_x86_64 13 0 0
org.apache.cassandra.cql3.functions.CastFctsTest-oa_jdk11_x86_64 13 0 0
org.apache.cassandra.cql3.functions.CastFctsTest-oa_jdk17_x86_64 13 0 0
org.apache.cassandra.cql3.functions.CastFctsTest-system_keyspace_directory_jdk11_x86_64 13 0 0
org.apache.cassandra.cql3.functions.CastFctsTest-system_keyspace_directory_jdk17_x86_64 13 0 0
org.apache.cassandra.cql3.functions.ClusterMetadataFctsTest-_jdk11_x86_64 1 0 0
org.apache.cassandra.cql3.functions.ClusterMetadataFctsTest-_jdk17_x86_64 1 0 0
org.apache.cassandra.cql3.functions.ClusterMetadataFctsTest-cdc_jdk11_x86_64 1 0 0
org.apache.cassandra.cql3.functions.ClusterMetadataFctsTest-cdc_jdk17_x86_64 1 0 0
org.apache.cassandra.cql3.functions.ClusterMetadataFctsTest-compression_jdk11_x86_64 1 0 0
org.apache.cassandra.cql3.functions.ClusterMetadataFctsTest-compression_jdk17_x86_64 1 0 0
org.apache.cassandra.cql3.functions.ClusterMetadataFctsTest-latest_jdk11_x86_64 1 0 0
org.apache.cassandra.cql3.functions.ClusterMetadataFctsTest-latest_jdk17_x86_64 1 0 0
org.apache.cassandra.cql3.functions.ClusterMetadataFctsTest-oa_jdk11_x86_64 1 0 0
org.apache.cassandra.cql3.functions.ClusterMetadataFctsTest-oa_jdk17_x86_64 1 0 0
org.apache.cassandra.cql3.functions.ClusterMetadataFctsTest-system_keyspace_directory_jdk11_x86_64 1 0 0
org.apache.cassandra.cql3.functions.ClusterMetadataFctsTest-system_keyspace_directory_jdk17_x86_64 1 0 0
org.apache.cassandra.cql3.functions.CollectionFctsTest-_jdk11_x86_64 12 0 0
org.apache.cassandra.cql3.functions.CollectionFctsTest-_jdk17_x86_64 12 0 0
org.apache.cassandra.cql3.functions.CollectionFctsTest-cdc_jdk11_x86_64 12 0 0
org.apache.cassandra.cql3.functions.CollectionFctsTest-cdc_jdk17_x86_64 12 0 0
org.apache.cassandra.cql3.functions.CollectionFctsTest-compression_jdk11_x86_64 12 0 0
org.apache.cassandra.cql3.functions.CollectionFctsTest-compression_jdk17_x86_64 12 0 0
org.apache.cassandra.cql3.functions.CollectionFctsTest-latest_jdk11_x86_64 12 0 0
org.apache.cassandra.cql3.functions.CollectionFctsTest-latest_jdk17_x86_64 12 0 0
org.apache.cassandra.cql3.functions.CollectionFctsTest-oa_jdk11_x86_64 12 0 0
org.apache.cassandra.cql3.functions.CollectionFctsTest-oa_jdk17_x86_64 12 0 0
org.apache.cassandra.cql3.functions.CollectionFctsTest-system_keyspace_directory_jdk11_x86_64 12 0 0
org.apache.cassandra.cql3.functions.CollectionFctsTest-system_keyspace_directory_jdk17_x86_64 12 0 0
org.apache.cassandra.cql3.functions.FunctionFactoryTest-_jdk11_x86_64 9 0 0
org.apache.cassandra.cql3.functions.FunctionFactoryTest-_jdk17_x86_64 9 0 0
org.apache.cassandra.cql3.functions.FunctionFactoryTest-cdc_jdk11_x86_64 9 0 0
org.apache.cassandra.cql3.functions.FunctionFactoryTest-cdc_jdk17_x86_64 9 0 0
org.apache.cassandra.cql3.functions.FunctionFactoryTest-compression_jdk11_x86_64 9 0 0
org.apache.cassandra.cql3.functions.FunctionFactoryTest-compression_jdk17_x86_64 9 0 0
org.apache.cassandra.cql3.functions.FunctionFactoryTest-latest_jdk11_x86_64 9 0 0
org.apache.cassandra.cql3.functions.FunctionFactoryTest-latest_jdk17_x86_64 9 0 0
org.apache.cassandra.cql3.functions.FunctionFactoryTest-oa_jdk11_x86_64 9 0 0
org.apache.cassandra.cql3.functions.FunctionFactoryTest-oa_jdk17_x86_64 9 0 0
org.apache.cassandra.cql3.functions.FunctionFactoryTest-system_keyspace_directory_jdk11_x86_64 9 0 0
org.apache.cassandra.cql3.functions.FunctionFactoryTest-system_keyspace_directory_jdk17_x86_64 9 0 0
org.apache.cassandra.cql3.functions.MathFctsTest-_jdk11_x86_64 5 0 0
org.apache.cassandra.cql3.functions.MathFctsTest-_jdk17_x86_64 5 0 0
org.apache.cassandra.cql3.functions.MathFctsTest-cdc_jdk11_x86_64 5 0 0
org.apache.cassandra.cql3.functions.MathFctsTest-cdc_jdk17_x86_64 5 0 0
org.apache.cassandra.cql3.functions.MathFctsTest-compression_jdk11_x86_64 5 0 0
org.apache.cassandra.cql3.functions.MathFctsTest-compression_jdk17_x86_64 5 0 0
org.apache.cassandra.cql3.functions.MathFctsTest-latest_jdk11_x86_64 5 0 0
org.apache.cassandra.cql3.functions.MathFctsTest-latest_jdk17_x86_64 5 0 0
org.apache.cassandra.cql3.functions.MathFctsTest-oa_jdk11_x86_64 5 0 0
org.apache.cassandra.cql3.functions.MathFctsTest-oa_jdk17_x86_64 5 0 0
org.apache.cassandra.cql3.functions.MathFctsTest-system_keyspace_directory_jdk11_x86_64 5 0 0
org.apache.cassandra.cql3.functions.MathFctsTest-system_keyspace_directory_jdk17_x86_64 5 0 0
org.apache.cassandra.cql3.functions.NativeFunctionsTest-_jdk11_x86_64 2 0 0
org.apache.cassandra.cql3.functions.NativeFunctionsTest-_jdk17_x86_64 2 0 0
org.apache.cassandra.cql3.functions.NativeFunctionsTest-cdc_jdk11_x86_64 2 0 0
org.apache.cassandra.cql3.functions.NativeFunctionsTest-cdc_jdk17_x86_64 2 0 0
org.apache.cassandra.cql3.functions.NativeFunctionsTest-compression_jdk11_x86_64 2 0 0
org.apache.cassandra.cql3.functions.NativeFunctionsTest-compression_jdk17_x86_64 2 0 0
org.apache.cassandra.cql3.functions.NativeFunctionsTest-latest_jdk11_x86_64 2 0 0
org.apache.cassandra.cql3.functions.NativeFunctionsTest-latest_jdk17_x86_64 2 0 0
org.apache.cassandra.cql3.functions.NativeFunctionsTest-oa_jdk11_x86_64 2 0 0
org.apache.cassandra.cql3.functions.NativeFunctionsTest-oa_jdk17_x86_64 2 0 0
org.apache.cassandra.cql3.functions.NativeFunctionsTest-system_keyspace_directory_jdk11_x86_64 2 0 0
org.apache.cassandra.cql3.functions.NativeFunctionsTest-system_keyspace_directory_jdk17_x86_64 2 0 0
org.apache.cassandra.cql3.functions.OperationFctsTest-_jdk11_x86_64 13 0 0
org.apache.cassandra.cql3.functions.OperationFctsTest-_jdk17_x86_64 13 0 0
org.apache.cassandra.cql3.functions.OperationFctsTest-cdc_jdk11_x86_64 13 0 0
org.apache.cassandra.cql3.functions.OperationFctsTest-cdc_jdk17_x86_64 13 0 0
org.apache.cassandra.cql3.functions.OperationFctsTest-compression_jdk11_x86_64 13 0 0
org.apache.cassandra.cql3.functions.OperationFctsTest-compression_jdk17_x86_64 13 0 0
org.apache.cassandra.cql3.functions.OperationFctsTest-latest_jdk11_x86_64 13 0 0
org.apache.cassandra.cql3.functions.OperationFctsTest-latest_jdk17_x86_64 13 0 0
org.apache.cassandra.cql3.functions.OperationFctsTest-oa_jdk11_x86_64 13 0 0
org.apache.cassandra.cql3.functions.OperationFctsTest-oa_jdk17_x86_64 13 0 0
org.apache.cassandra.cql3.functions.OperationFctsTest-system_keyspace_directory_jdk11_x86_64 13 0 0
org.apache.cassandra.cql3.functions.OperationFctsTest-system_keyspace_directory_jdk17_x86_64 13 0 0
org.apache.cassandra.cql3.functions.TimeFctsTest-_jdk11_x86_64 15 0 0
org.apache.cassandra.cql3.functions.TimeFctsTest-_jdk17_x86_64 15 0 0
org.apache.cassandra.cql3.functions.TimeFctsTest-cdc_jdk11_x86_64 15 0 0
org.apache.cassandra.cql3.functions.TimeFctsTest-cdc_jdk17_x86_64 15 0 0
org.apache.cassandra.cql3.functions.TimeFctsTest-compression_jdk11_x86_64 15 0 0
org.apache.cassandra.cql3.functions.TimeFctsTest-compression_jdk17_x86_64 15 0 0
org.apache.cassandra.cql3.functions.TimeFctsTest-latest_jdk11_x86_64 15 0 0
org.apache.cassandra.cql3.functions.TimeFctsTest-latest_jdk17_x86_64 15 0 0
org.apache.cassandra.cql3.functions.TimeFctsTest-oa_jdk11_x86_64 15 0 0
org.apache.cassandra.cql3.functions.TimeFctsTest-oa_jdk17_x86_64 15 0 0
org.apache.cassandra.cql3.functions.TimeFctsTest-system_keyspace_directory_jdk11_x86_64 15 0 0
org.apache.cassandra.cql3.functions.TimeFctsTest-system_keyspace_directory_jdk17_x86_64 15 0 0
org.apache.cassandra.cql3.functions.VectorFctsTest-_jdk11_x86_64 3 0 0
org.apache.cassandra.cql3.functions.VectorFctsTest-_jdk17_x86_64 3 0 0
org.apache.cassandra.cql3.functions.VectorFctsTest-cdc_jdk11_x86_64 3 0 0
org.apache.cassandra.cql3.functions.VectorFctsTest-cdc_jdk17_x86_64 3 0 0
org.apache.cassandra.cql3.functions.VectorFctsTest-compression_jdk11_x86_64 3 0 0
org.apache.cassandra.cql3.functions.VectorFctsTest-compression_jdk17_x86_64 3 0 0
org.apache.cassandra.cql3.functions.VectorFctsTest-latest_jdk11_x86_64 3 0 0
org.apache.cassandra.cql3.functions.VectorFctsTest-latest_jdk17_x86_64 3 0 0
org.apache.cassandra.cql3.functions.VectorFctsTest-oa_jdk11_x86_64 3 0 0
org.apache.cassandra.cql3.functions.VectorFctsTest-oa_jdk17_x86_64 3 0 0
org.apache.cassandra.cql3.functions.VectorFctsTest-system_keyspace_directory_jdk11_x86_64 3 0 0
org.apache.cassandra.cql3.functions.VectorFctsTest-system_keyspace_directory_jdk17_x86_64 3 0 0
org.apache.cassandra.cql3.functions.masking.ColumnMaskInAnyPositionWithDefaultTest-_jdk11_x86_64 24 0 0
org.apache.cassandra.cql3.functions.masking.ColumnMaskInAnyPositionWithDefaultTest-_jdk17_x86_64 24 0 0
org.apache.cassandra.cql3.functions.masking.ColumnMaskInAnyPositionWithDefaultTest-cdc_jdk11_x86_64 24 0 0
org.apache.cassandra.cql3.functions.masking.ColumnMaskInAnyPositionWithDefaultTest-cdc_jdk17_x86_64 24 0 0
org.apache.cassandra.cql3.functions.masking.ColumnMaskInAnyPositionWithDefaultTest-compression_jdk11_x86_64 24 0 0
org.apache.cassandra.cql3.functions.masking.ColumnMaskInAnyPositionWithDefaultTest-compression_jdk17_x86_64 24 0 0
org.apache.cassandra.cql3.functions.masking.ColumnMaskInAnyPositionWithDefaultTest-latest_jdk11_x86_64 24 0 0
org.apache.cassandra.cql3.functions.masking.ColumnMaskInAnyPositionWithDefaultTest-latest_jdk17_x86_64 24 0 0
org.apache.cassandra.cql3.functions.masking.ColumnMaskInAnyPositionWithDefaultTest-oa_jdk11_x86_64 24 0 0
org.apache.cassandra.cql3.functions.masking.ColumnMaskInAnyPositionWithDefaultTest-oa_jdk17_x86_64 24 0 0
org.apache.cassandra.cql3.functions.masking.ColumnMaskInAnyPositionWithDefaultTest-system_keyspace_directory_jdk11_x86_64 24 0 0
org.apache.cassandra.cql3.functions.masking.ColumnMaskInAnyPositionWithDefaultTest-system_keyspace_directory_jdk17_x86_64 24 0 0
org.apache.cassandra.cql3.functions.masking.ColumnMaskInAnyPositionWithNullTest-_jdk11_x86_64 12 0 0
org.apache.cassandra.cql3.functions.masking.ColumnMaskInAnyPositionWithNullTest-_jdk17_x86_64 12 0 0
org.apache.cassandra.cql3.functions.masking.ColumnMaskInAnyPositionWithNullTest-cdc_jdk11_x86_64 12 0 0
org.apache.cassandra.cql3.functions.masking.ColumnMaskInAnyPositionWithNullTest-cdc_jdk17_x86_64 12 0 0
org.apache.cassandra.cql3.functions.masking.ColumnMaskInAnyPositionWithNullTest-compression_jdk11_x86_64 12 0 0
org.apache.cassandra.cql3.functions.masking.ColumnMaskInAnyPositionWithNullTest-compression_jdk17_x86_64 12 0 0
org.apache.cassandra.cql3.functions.masking.ColumnMaskInAnyPositionWithNullTest-latest_jdk11_x86_64 12 0 0
org.apache.cassandra.cql3.functions.masking.ColumnMaskInAnyPositionWithNullTest-latest_jdk17_x86_64 12 0 0
org.apache.cassandra.cql3.functions.masking.ColumnMaskInAnyPositionWithNullTest-oa_jdk11_x86_64 12 0 0
org.apache.cassandra.cql3.functions.masking.ColumnMaskInAnyPositionWithNullTest-oa_jdk17_x86_64 12 0 0
org.apache.cassandra.cql3.functions.masking.ColumnMaskInAnyPositionWithNullTest-system_keyspace_directory_jdk11_x86_64 12 0 0
org.apache.cassandra.cql3.functions.masking.ColumnMaskInAnyPositionWithNullTest-system_keyspace_directory_jdk17_x86_64 12 0 0
org.apache.cassandra.cql3.functions.masking.ColumnMaskInAnyPositionWithPartialTest-_jdk11_x86_64 16 0 0
org.apache.cassandra.cql3.functions.masking.ColumnMaskInAnyPositionWithPartialTest-_jdk17_x86_64 16 0 0
org.apache.cassandra.cql3.functions.masking.ColumnMaskInAnyPositionWithPartialTest-cdc_jdk11_x86_64 16 0 0
org.apache.cassandra.cql3.functions.masking.ColumnMaskInAnyPositionWithPartialTest-cdc_jdk17_x86_64 16 0 0
org.apache.cassandra.cql3.functions.masking.ColumnMaskInAnyPositionWithPartialTest-compression_jdk11_x86_64 16 0 0
org.apache.cassandra.cql3.functions.masking.ColumnMaskInAnyPositionWithPartialTest-compression_jdk17_x86_64 16 0 0
org.apache.cassandra.cql3.functions.masking.ColumnMaskInAnyPositionWithPartialTest-latest_jdk11_x86_64 16 0 0
org.apache.cassandra.cql3.functions.masking.ColumnMaskInAnyPositionWithPartialTest-latest_jdk17_x86_64 16 0 0
org.apache.cassandra.cql3.functions.masking.ColumnMaskInAnyPositionWithPartialTest-oa_jdk11_x86_64 16 0 0
org.apache.cassandra.cql3.functions.masking.ColumnMaskInAnyPositionWithPartialTest-oa_jdk17_x86_64 16 0 0
org.apache.cassandra.cql3.functions.masking.ColumnMaskInAnyPositionWithPartialTest-system_keyspace_directory_jdk11_x86_64 16 0 0
org.apache.cassandra.cql3.functions.masking.ColumnMaskInAnyPositionWithPartialTest-system_keyspace_directory_jdk17_x86_64 16 0 0
org.apache.cassandra.cql3.functions.masking.ColumnMaskInAnyPositionWithReplaceTest-_jdk11_x86_64 12 0 0
org.apache.cassandra.cql3.functions.masking.ColumnMaskInAnyPositionWithReplaceTest-_jdk17_x86_64 12 0 0
org.apache.cassandra.cql3.functions.masking.ColumnMaskInAnyPositionWithReplaceTest-cdc_jdk11_x86_64 12 0 0
org.apache.cassandra.cql3.functions.masking.ColumnMaskInAnyPositionWithReplaceTest-cdc_jdk17_x86_64 12 0 0
org.apache.cassandra.cql3.functions.masking.ColumnMaskInAnyPositionWithReplaceTest-compression_jdk11_x86_64 12 0 0
org.apache.cassandra.cql3.functions.masking.ColumnMaskInAnyPositionWithReplaceTest-compression_jdk17_x86_64 12 0 0
org.apache.cassandra.cql3.functions.masking.ColumnMaskInAnyPositionWithReplaceTest-latest_jdk11_x86_64 12 0 0
org.apache.cassandra.cql3.functions.masking.ColumnMaskInAnyPositionWithReplaceTest-latest_jdk17_x86_64 12 0 0
org.apache.cassandra.cql3.functions.masking.ColumnMaskInAnyPositionWithReplaceTest-oa_jdk11_x86_64 12 0 0
org.apache.cassandra.cql3.functions.masking.ColumnMaskInAnyPositionWithReplaceTest-oa_jdk17_x86_64 12 0 0
org.apache.cassandra.cql3.functions.masking.ColumnMaskInAnyPositionWithReplaceTest-system_keyspace_directory_jdk11_x86_64 12 0 0
org.apache.cassandra.cql3.functions.masking.ColumnMaskInAnyPositionWithReplaceTest-system_keyspace_directory_jdk17_x86_64 12 0 0
org.apache.cassandra.cql3.functions.masking.ColumnMaskInAnyPositionWithUDFTest-_jdk11_x86_64 8 0 0
org.apache.cassandra.cql3.functions.masking.ColumnMaskInAnyPositionWithUDFTest-_jdk17_x86_64 8 0 0
org.apache.cassandra.cql3.functions.masking.ColumnMaskInAnyPositionWithUDFTest-cdc_jdk11_x86_64 8 0 0
org.apache.cassandra.cql3.functions.masking.ColumnMaskInAnyPositionWithUDFTest-cdc_jdk17_x86_64 8 0 0
org.apache.cassandra.cql3.functions.masking.ColumnMaskInAnyPositionWithUDFTest-compression_jdk11_x86_64 8 0 0
org.apache.cassandra.cql3.functions.masking.ColumnMaskInAnyPositionWithUDFTest-compression_jdk17_x86_64 8 0 0
org.apache.cassandra.cql3.functions.masking.ColumnMaskInAnyPositionWithUDFTest-latest_jdk11_x86_64 8 0 0
org.apache.cassandra.cql3.functions.masking.ColumnMaskInAnyPositionWithUDFTest-latest_jdk17_x86_64 8 0 0
org.apache.cassandra.cql3.functions.masking.ColumnMaskInAnyPositionWithUDFTest-oa_jdk11_x86_64 8 0 0
org.apache.cassandra.cql3.functions.masking.ColumnMaskInAnyPositionWithUDFTest-oa_jdk17_x86_64 8 0 0
org.apache.cassandra.cql3.functions.masking.ColumnMaskInAnyPositionWithUDFTest-system_keyspace_directory_jdk11_x86_64 8 0 0
org.apache.cassandra.cql3.functions.masking.ColumnMaskInAnyPositionWithUDFTest-system_keyspace_directory_jdk17_x86_64 8 0 0
org.apache.cassandra.cql3.functions.masking.ColumnMaskNativeTypesTest-_jdk11_x86_64 21 0 0
org.apache.cassandra.cql3.functions.masking.ColumnMaskNativeTypesTest-_jdk17_x86_64 21 0 0
org.apache.cassandra.cql3.functions.masking.ColumnMaskNativeTypesTest-cdc_jdk11_x86_64 21 0 0
org.apache.cassandra.cql3.functions.masking.ColumnMaskNativeTypesTest-cdc_jdk17_x86_64 21 0 0
org.apache.cassandra.cql3.functions.masking.ColumnMaskNativeTypesTest-compression_jdk11_x86_64 21 0 0
org.apache.cassandra.cql3.functions.masking.ColumnMaskNativeTypesTest-compression_jdk17_x86_64 21 0 0
org.apache.cassandra.cql3.functions.masking.ColumnMaskNativeTypesTest-latest_jdk11_x86_64 21 0 0
org.apache.cassandra.cql3.functions.masking.ColumnMaskNativeTypesTest-latest_jdk17_x86_64 21 0 0
org.apache.cassandra.cql3.functions.masking.ColumnMaskNativeTypesTest-oa_jdk11_x86_64 21 0 0
org.apache.cassandra.cql3.functions.masking.ColumnMaskNativeTypesTest-oa_jdk17_x86_64 21 0 0
org.apache.cassandra.cql3.functions.masking.ColumnMaskNativeTypesTest-system_keyspace_directory_jdk11_x86_64 21 0 0
org.apache.cassandra.cql3.functions.masking.ColumnMaskNativeTypesTest-system_keyspace_directory_jdk17_x86_64 21 0 0
org.apache.cassandra.cql3.functions.masking.ColumnMaskQueryWithDefaultTest-_jdk11_x86_64 40 0 0
org.apache.cassandra.cql3.functions.masking.ColumnMaskQueryWithDefaultTest-_jdk17_x86_64 40 0 0
org.apache.cassandra.cql3.functions.masking.ColumnMaskQueryWithDefaultTest-cdc_jdk11_x86_64 40 0 0
org.apache.cassandra.cql3.functions.masking.ColumnMaskQueryWithDefaultTest-cdc_jdk17_x86_64 40 0 0
org.apache.cassandra.cql3.functions.masking.ColumnMaskQueryWithDefaultTest-compression_jdk11_x86_64 40 0 0
org.apache.cassandra.cql3.functions.masking.ColumnMaskQueryWithDefaultTest-compression_jdk17_x86_64 40 0 0
org.apache.cassandra.cql3.functions.masking.ColumnMaskQueryWithDefaultTest-latest_jdk11_x86_64 40 0 0
org.apache.cassandra.cql3.functions.masking.ColumnMaskQueryWithDefaultTest-latest_jdk17_x86_64 40 0 0
org.apache.cassandra.cql3.functions.masking.ColumnMaskQueryWithDefaultTest-oa_jdk11_x86_64 40 0 0
org.apache.cassandra.cql3.functions.masking.ColumnMaskQueryWithDefaultTest-oa_jdk17_x86_64 40 0 0
org.apache.cassandra.cql3.functions.masking.ColumnMaskQueryWithDefaultTest-system_keyspace_directory_jdk11_x86_64 40 0 0
org.apache.cassandra.cql3.functions.masking.ColumnMaskQueryWithDefaultTest-system_keyspace_directory_jdk17_x86_64 40 0 0
org.apache.cassandra.cql3.functions.masking.ColumnMaskQueryWithNullTest-_jdk11_x86_64 16 0 0
org.apache.cassandra.cql3.functions.masking.ColumnMaskQueryWithNullTest-_jdk17_x86_64 16 0 0
org.apache.cassandra.cql3.functions.masking.ColumnMaskQueryWithNullTest-cdc_jdk11_x86_64 16 0 0
org.apache.cassandra.cql3.functions.masking.ColumnMaskQueryWithNullTest-cdc_jdk17_x86_64 16 0 0
org.apache.cassandra.cql3.functions.masking.ColumnMaskQueryWithNullTest-compression_jdk11_x86_64 16 0 0
org.apache.cassandra.cql3.functions.masking.ColumnMaskQueryWithNullTest-compression_jdk17_x86_64 16 0 0
org.apache.cassandra.cql3.functions.masking.ColumnMaskQueryWithNullTest-latest_jdk11_x86_64 16 0 0
org.apache.cassandra.cql3.functions.masking.ColumnMaskQueryWithNullTest-latest_jdk17_x86_64 16 0 0
org.apache.cassandra.cql3.functions.masking.ColumnMaskQueryWithNullTest-oa_jdk11_x86_64 16 0 0
org.apache.cassandra.cql3.functions.masking.ColumnMaskQueryWithNullTest-oa_jdk17_x86_64 16 0 0
org.apache.cassandra.cql3.functions.masking.ColumnMaskQueryWithNullTest-system_keyspace_directory_jdk11_x86_64 16 0 0
org.apache.cassandra.cql3.functions.masking.ColumnMaskQueryWithNullTest-system_keyspace_directory_jdk17_x86_64 16 0 0
org.apache.cassandra.cql3.functions.masking.ColumnMaskQueryWithPartialTest-_jdk11_x86_64 48 0 0
org.apache.cassandra.cql3.functions.masking.ColumnMaskQueryWithPartialTest-_jdk17_x86_64 48 0 0
org.apache.cassandra.cql3.functions.masking.ColumnMaskQueryWithPartialTest-cdc_jdk11_x86_64 48 0 0
org.apache.cassandra.cql3.functions.masking.ColumnMaskQueryWithPartialTest-cdc_jdk17_x86_64 48 0 0
org.apache.cassandra.cql3.functions.masking.ColumnMaskQueryWithPartialTest-compression_jdk11_x86_64 48 0 0
org.apache.cassandra.cql3.functions.masking.ColumnMaskQueryWithPartialTest-compression_jdk17_x86_64 48 0 0
org.apache.cassandra.cql3.functions.masking.ColumnMaskQueryWithPartialTest-latest_jdk11_x86_64 48 0 0
org.apache.cassandra.cql3.functions.masking.ColumnMaskQueryWithPartialTest-latest_jdk17_x86_64 48 0 0
org.apache.cassandra.cql3.functions.masking.ColumnMaskQueryWithPartialTest-oa_jdk11_x86_64 48 0 0
org.apache.cassandra.cql3.functions.masking.ColumnMaskQueryWithPartialTest-oa_jdk17_x86_64 48 0 0
org.apache.cassandra.cql3.functions.masking.ColumnMaskQueryWithPartialTest-system_keyspace_directory_jdk11_x86_64 48 0 0
org.apache.cassandra.cql3.functions.masking.ColumnMaskQueryWithPartialTest-system_keyspace_directory_jdk17_x86_64 48 0 0
org.apache.cassandra.cql3.functions.masking.ColumnMaskQueryWithReplaceTest-_jdk11_x86_64 56 0 0
org.apache.cassandra.cql3.functions.masking.ColumnMaskQueryWithReplaceTest-_jdk17_x86_64 56 0 0
org.apache.cassandra.cql3.functions.masking.ColumnMaskQueryWithReplaceTest-cdc_jdk11_x86_64 56 0 0
org.apache.cassandra.cql3.functions.masking.ColumnMaskQueryWithReplaceTest-cdc_jdk17_x86_64 56 0 0
org.apache.cassandra.cql3.functions.masking.ColumnMaskQueryWithReplaceTest-compression_jdk11_x86_64 56 0 0
org.apache.cassandra.cql3.functions.masking.ColumnMaskQueryWithReplaceTest-compression_jdk17_x86_64 56 0 0
org.apache.cassandra.cql3.functions.masking.ColumnMaskQueryWithReplaceTest-latest_jdk11_x86_64 56 0 0
org.apache.cassandra.cql3.functions.masking.ColumnMaskQueryWithReplaceTest-latest_jdk17_x86_64 56 0 0
org.apache.cassandra.cql3.functions.masking.ColumnMaskQueryWithReplaceTest-oa_jdk11_x86_64 56 0 0
org.apache.cassandra.cql3.functions.masking.ColumnMaskQueryWithReplaceTest-oa_jdk17_x86_64 56 0 0
org.apache.cassandra.cql3.functions.masking.ColumnMaskQueryWithReplaceTest-system_keyspace_directory_jdk11_x86_64 56 0 0
org.apache.cassandra.cql3.functions.masking.ColumnMaskQueryWithReplaceTest-system_keyspace_directory_jdk17_x86_64 56 0 0
org.apache.cassandra.cql3.functions.masking.ColumnMaskQueryWithUDFTest-_jdk11_x86_64 32 0 0
org.apache.cassandra.cql3.functions.masking.ColumnMaskQueryWithUDFTest-_jdk17_x86_64 32 0 0
org.apache.cassandra.cql3.functions.masking.ColumnMaskQueryWithUDFTest-cdc_jdk11_x86_64 32 0 0
org.apache.cassandra.cql3.functions.masking.ColumnMaskQueryWithUDFTest-cdc_jdk17_x86_64 32 0 0
org.apache.cassandra.cql3.functions.masking.ColumnMaskQueryWithUDFTest-compression_jdk11_x86_64 32 0 0
org.apache.cassandra.cql3.functions.masking.ColumnMaskQueryWithUDFTest-compression_jdk17_x86_64 32 0 0
org.apache.cassandra.cql3.functions.masking.ColumnMaskQueryWithUDFTest-latest_jdk11_x86_64 32 0 0
org.apache.cassandra.cql3.functions.masking.ColumnMaskQueryWithUDFTest-latest_jdk17_x86_64 32 0 0
org.apache.cassandra.cql3.functions.masking.ColumnMaskQueryWithUDFTest-oa_jdk11_x86_64 32 0 0
org.apache.cassandra.cql3.functions.masking.ColumnMaskQueryWithUDFTest-oa_jdk17_x86_64 32 0 0
org.apache.cassandra.cql3.functions.masking.ColumnMaskQueryWithUDFTest-system_keyspace_directory_jdk11_x86_64 32 0 0
org.apache.cassandra.cql3.functions.masking.ColumnMaskQueryWithUDFTest-system_keyspace_directory_jdk17_x86_64 32 0 0
org.apache.cassandra.cql3.functions.masking.ColumnMaskTest-_jdk11_x86_64 17 0 0
org.apache.cassandra.cql3.functions.masking.ColumnMaskTest-_jdk17_x86_64 17 0 0
org.apache.cassandra.cql3.functions.masking.ColumnMaskTest-cdc_jdk11_x86_64 17 0 0
org.apache.cassandra.cql3.functions.masking.ColumnMaskTest-cdc_jdk17_x86_64 17 0 0
org.apache.cassandra.cql3.functions.masking.ColumnMaskTest-compression_jdk11_x86_64 17 0 0
org.apache.cassandra.cql3.functions.masking.ColumnMaskTest-compression_jdk17_x86_64 17 0 0
org.apache.cassandra.cql3.functions.masking.ColumnMaskTest-latest_jdk11_x86_64 17 0 0
org.apache.cassandra.cql3.functions.masking.ColumnMaskTest-latest_jdk17_x86_64 17 0 0
org.apache.cassandra.cql3.functions.masking.ColumnMaskTest-oa_jdk11_x86_64 17 0 0
org.apache.cassandra.cql3.functions.masking.ColumnMaskTest-oa_jdk17_x86_64 17 0 0
org.apache.cassandra.cql3.functions.masking.ColumnMaskTest-system_keyspace_directory_jdk11_x86_64 17 0 0
org.apache.cassandra.cql3.functions.masking.ColumnMaskTest-system_keyspace_directory_jdk17_x86_64 17 0 0
org.apache.cassandra.cql3.functions.masking.ColumnMaskWithTypeAlteringFunctionTest-_jdk11_x86_64 39 0 0
org.apache.cassandra.cql3.functions.masking.ColumnMaskWithTypeAlteringFunctionTest-_jdk17_x86_64 39 0 0
org.apache.cassandra.cql3.functions.masking.ColumnMaskWithTypeAlteringFunctionTest-cdc_jdk11_x86_64 39 0 0
org.apache.cassandra.cql3.functions.masking.ColumnMaskWithTypeAlteringFunctionTest-cdc_jdk17_x86_64 39 0 0
org.apache.cassandra.cql3.functions.masking.ColumnMaskWithTypeAlteringFunctionTest-compression_jdk11_x86_64 39 0 0
org.apache.cassandra.cql3.functions.masking.ColumnMaskWithTypeAlteringFunctionTest-compression_jdk17_x86_64 39 0 0
org.apache.cassandra.cql3.functions.masking.ColumnMaskWithTypeAlteringFunctionTest-latest_jdk11_x86_64 39 0 0
org.apache.cassandra.cql3.functions.masking.ColumnMaskWithTypeAlteringFunctionTest-latest_jdk17_x86_64 39 0 0
org.apache.cassandra.cql3.functions.masking.ColumnMaskWithTypeAlteringFunctionTest-oa_jdk11_x86_64 39 0 0
org.apache.cassandra.cql3.functions.masking.ColumnMaskWithTypeAlteringFunctionTest-oa_jdk17_x86_64 39 0 0
org.apache.cassandra.cql3.functions.masking.ColumnMaskWithTypeAlteringFunctionTest-system_keyspace_directory_jdk11_x86_64 39 0 0
org.apache.cassandra.cql3.functions.masking.ColumnMaskWithTypeAlteringFunctionTest-system_keyspace_directory_jdk17_x86_64 39 0 0
org.apache.cassandra.cql3.functions.masking.ColumnMaskWithUDFTest-_jdk11_x86_64 10 0 0
org.apache.cassandra.cql3.functions.masking.ColumnMaskWithUDFTest-_jdk17_x86_64 10 0 0
org.apache.cassandra.cql3.functions.masking.ColumnMaskWithUDFTest-cdc_jdk11_x86_64 10 0 0
org.apache.cassandra.cql3.functions.masking.ColumnMaskWithUDFTest-cdc_jdk17_x86_64 10 0 0
org.apache.cassandra.cql3.functions.masking.ColumnMaskWithUDFTest-compression_jdk11_x86_64 10 0 0
org.apache.cassandra.cql3.functions.masking.ColumnMaskWithUDFTest-compression_jdk17_x86_64 10 0 0
org.apache.cassandra.cql3.functions.masking.ColumnMaskWithUDFTest-latest_jdk11_x86_64 10 0 0
org.apache.cassandra.cql3.functions.masking.ColumnMaskWithUDFTest-latest_jdk17_x86_64 10 0 0
org.apache.cassandra.cql3.functions.masking.ColumnMaskWithUDFTest-oa_jdk11_x86_64 10 0 0
org.apache.cassandra.cql3.functions.masking.ColumnMaskWithUDFTest-oa_jdk17_x86_64 10 0 0
org.apache.cassandra.cql3.functions.masking.ColumnMaskWithUDFTest-system_keyspace_directory_jdk11_x86_64 10 0 0
org.apache.cassandra.cql3.functions.masking.ColumnMaskWithUDFTest-system_keyspace_directory_jdk17_x86_64 10 0 0
org.apache.cassandra.cql3.functions.masking.DefaultMaskingFunctionTest-_jdk11_x86_64 5 0 0
org.apache.cassandra.cql3.functions.masking.DefaultMaskingFunctionTest-_jdk17_x86_64 5 0 0
org.apache.cassandra.cql3.functions.masking.DefaultMaskingFunctionTest-cdc_jdk11_x86_64 5 0 0
org.apache.cassandra.cql3.functions.masking.DefaultMaskingFunctionTest-cdc_jdk17_x86_64 5 0 0
org.apache.cassandra.cql3.functions.masking.DefaultMaskingFunctionTest-compression_jdk11_x86_64 5 0 0
org.apache.cassandra.cql3.functions.masking.DefaultMaskingFunctionTest-compression_jdk17_x86_64 5 0 0
org.apache.cassandra.cql3.functions.masking.DefaultMaskingFunctionTest-latest_jdk11_x86_64 5 0 0
org.apache.cassandra.cql3.functions.masking.DefaultMaskingFunctionTest-latest_jdk17_x86_64 5 0 0
org.apache.cassandra.cql3.functions.masking.DefaultMaskingFunctionTest-oa_jdk11_x86_64 5 0 0
org.apache.cassandra.cql3.functions.masking.DefaultMaskingFunctionTest-oa_jdk17_x86_64 5 0 0
org.apache.cassandra.cql3.functions.masking.DefaultMaskingFunctionTest-system_keyspace_directory_jdk11_x86_64 5 0 0
org.apache.cassandra.cql3.functions.masking.DefaultMaskingFunctionTest-system_keyspace_directory_jdk17_x86_64 5 0 0
org.apache.cassandra.cql3.functions.masking.HashMaskingFunctionTest-_jdk11_x86_64 5 0 0
org.apache.cassandra.cql3.functions.masking.HashMaskingFunctionTest-_jdk17_x86_64 5 0 0
org.apache.cassandra.cql3.functions.masking.HashMaskingFunctionTest-cdc_jdk11_x86_64 5 0 0
org.apache.cassandra.cql3.functions.masking.HashMaskingFunctionTest-cdc_jdk17_x86_64 5 0 0
org.apache.cassandra.cql3.functions.masking.HashMaskingFunctionTest-compression_jdk11_x86_64 5 0 0
org.apache.cassandra.cql3.functions.masking.HashMaskingFunctionTest-compression_jdk17_x86_64 5 0 0
org.apache.cassandra.cql3.functions.masking.HashMaskingFunctionTest-latest_jdk11_x86_64 5 0 0
org.apache.cassandra.cql3.functions.masking.HashMaskingFunctionTest-latest_jdk17_x86_64 5 0 0
org.apache.cassandra.cql3.functions.masking.HashMaskingFunctionTest-oa_jdk11_x86_64 5 0 0
org.apache.cassandra.cql3.functions.masking.HashMaskingFunctionTest-oa_jdk17_x86_64 5 0 0
org.apache.cassandra.cql3.functions.masking.HashMaskingFunctionTest-system_keyspace_directory_jdk11_x86_64 5 0 0
org.apache.cassandra.cql3.functions.masking.HashMaskingFunctionTest-system_keyspace_directory_jdk17_x86_64 5 0 0
org.apache.cassandra.cql3.functions.masking.NullMaskingFunctionTest-_jdk11_x86_64 5 0 0
org.apache.cassandra.cql3.functions.masking.NullMaskingFunctionTest-_jdk17_x86_64 5 0 0
org.apache.cassandra.cql3.functions.masking.NullMaskingFunctionTest-cdc_jdk11_x86_64 5 0 0
org.apache.cassandra.cql3.functions.masking.NullMaskingFunctionTest-cdc_jdk17_x86_64 5 0 0
org.apache.cassandra.cql3.functions.masking.NullMaskingFunctionTest-compression_jdk11_x86_64 5 0 0
org.apache.cassandra.cql3.functions.masking.NullMaskingFunctionTest-compression_jdk17_x86_64 5 0 0
org.apache.cassandra.cql3.functions.masking.NullMaskingFunctionTest-latest_jdk11_x86_64 5 0 0
org.apache.cassandra.cql3.functions.masking.NullMaskingFunctionTest-latest_jdk17_x86_64 5 0 0
org.apache.cassandra.cql3.functions.masking.NullMaskingFunctionTest-oa_jdk11_x86_64 5 0 0
org.apache.cassandra.cql3.functions.masking.NullMaskingFunctionTest-oa_jdk17_x86_64 5 0 0
org.apache.cassandra.cql3.functions.masking.NullMaskingFunctionTest-system_keyspace_directory_jdk11_x86_64 5 0 0
org.apache.cassandra.cql3.functions.masking.NullMaskingFunctionTest-system_keyspace_directory_jdk17_x86_64 5 0 0
org.apache.cassandra.cql3.functions.masking.PartialMaskingFunctionTest-_jdk11_x86_64 6 0 0
org.apache.cassandra.cql3.functions.masking.PartialMaskingFunctionTest-_jdk17_x86_64 6 0 0
org.apache.cassandra.cql3.functions.masking.PartialMaskingFunctionTest-cdc_jdk11_x86_64 6 0 0
org.apache.cassandra.cql3.functions.masking.PartialMaskingFunctionTest-cdc_jdk17_x86_64 6 0 0
org.apache.cassandra.cql3.functions.masking.PartialMaskingFunctionTest-compression_jdk11_x86_64 6 0 0
org.apache.cassandra.cql3.functions.masking.PartialMaskingFunctionTest-compression_jdk17_x86_64 6 0 0
org.apache.cassandra.cql3.functions.masking.PartialMaskingFunctionTest-latest_jdk11_x86_64 6 0 0
org.apache.cassandra.cql3.functions.masking.PartialMaskingFunctionTest-latest_jdk17_x86_64 6 0 0
org.apache.cassandra.cql3.functions.masking.PartialMaskingFunctionTest-oa_jdk11_x86_64 6 0 0
org.apache.cassandra.cql3.functions.masking.PartialMaskingFunctionTest-oa_jdk17_x86_64 6 0 0
org.apache.cassandra.cql3.functions.masking.PartialMaskingFunctionTest-system_keyspace_directory_jdk11_x86_64 6 0 0
org.apache.cassandra.cql3.functions.masking.PartialMaskingFunctionTest-system_keyspace_directory_jdk17_x86_64 6 0 0
org.apache.cassandra.cql3.functions.masking.ReplaceMaskingFunctionTest-_jdk11_x86_64 6 0 0
org.apache.cassandra.cql3.functions.masking.ReplaceMaskingFunctionTest-_jdk17_x86_64 6 0 0
org.apache.cassandra.cql3.functions.masking.ReplaceMaskingFunctionTest-cdc_jdk11_x86_64 6 0 0
org.apache.cassandra.cql3.functions.masking.ReplaceMaskingFunctionTest-cdc_jdk17_x86_64 6 0 0
org.apache.cassandra.cql3.functions.masking.ReplaceMaskingFunctionTest-compression_jdk11_x86_64 6 0 0
org.apache.cassandra.cql3.functions.masking.ReplaceMaskingFunctionTest-compression_jdk17_x86_64 6 0 0
org.apache.cassandra.cql3.functions.masking.ReplaceMaskingFunctionTest-latest_jdk11_x86_64 6 0 0
org.apache.cassandra.cql3.functions.masking.ReplaceMaskingFunctionTest-latest_jdk17_x86_64 6 0 0
org.apache.cassandra.cql3.functions.masking.ReplaceMaskingFunctionTest-oa_jdk11_x86_64 6 0 0
org.apache.cassandra.cql3.functions.masking.ReplaceMaskingFunctionTest-oa_jdk17_x86_64 6 0 0
org.apache.cassandra.cql3.functions.masking.ReplaceMaskingFunctionTest-system_keyspace_directory_jdk11_x86_64 6 0 0
org.apache.cassandra.cql3.functions.masking.ReplaceMaskingFunctionTest-system_keyspace_directory_jdk17_x86_64 6 0 0
org.apache.cassandra.cql3.functions.masking.SelectMaskedPermissionTest-_jdk11_x86_64 4 0 0
org.apache.cassandra.cql3.functions.masking.SelectMaskedPermissionTest-_jdk17_x86_64 4 0 0
org.apache.cassandra.cql3.functions.masking.SelectMaskedPermissionTest-cdc_jdk11_x86_64 4 0 0
org.apache.cassandra.cql3.functions.masking.SelectMaskedPermissionTest-cdc_jdk17_x86_64 4 0 0
org.apache.cassandra.cql3.functions.masking.SelectMaskedPermissionTest-compression_jdk11_x86_64 4 0 0
org.apache.cassandra.cql3.functions.masking.SelectMaskedPermissionTest-compression_jdk17_x86_64 4 0 0
org.apache.cassandra.cql3.functions.masking.SelectMaskedPermissionTest-latest_jdk11_x86_64 4 0 0
org.apache.cassandra.cql3.functions.masking.SelectMaskedPermissionTest-latest_jdk17_x86_64 4 0 0
org.apache.cassandra.cql3.functions.masking.SelectMaskedPermissionTest-oa_jdk11_x86_64 4 0 0
org.apache.cassandra.cql3.functions.masking.SelectMaskedPermissionTest-oa_jdk17_x86_64 4 0 0
org.apache.cassandra.cql3.functions.masking.SelectMaskedPermissionTest-system_keyspace_directory_jdk11_x86_64 4 0 0
org.apache.cassandra.cql3.functions.masking.SelectMaskedPermissionTest-system_keyspace_directory_jdk17_x86_64 4 0 0
org.apache.cassandra.cql3.functions.masking.UnmaskPermissionTest-_jdk11_x86_64 4 0 0
org.apache.cassandra.cql3.functions.masking.UnmaskPermissionTest-_jdk17_x86_64 4 0 0
org.apache.cassandra.cql3.functions.masking.UnmaskPermissionTest-cdc_jdk11_x86_64 4 0 0
org.apache.cassandra.cql3.functions.masking.UnmaskPermissionTest-cdc_jdk17_x86_64 4 0 0
org.apache.cassandra.cql3.functions.masking.UnmaskPermissionTest-compression_jdk11_x86_64 4 0 0
org.apache.cassandra.cql3.functions.masking.UnmaskPermissionTest-compression_jdk17_x86_64 4 0 0
org.apache.cassandra.cql3.functions.masking.UnmaskPermissionTest-latest_jdk11_x86_64 4 0 0
org.apache.cassandra.cql3.functions.masking.UnmaskPermissionTest-latest_jdk17_x86_64 4 0 0
org.apache.cassandra.cql3.functions.masking.UnmaskPermissionTest-oa_jdk11_x86_64 4 0 0
org.apache.cassandra.cql3.functions.masking.UnmaskPermissionTest-oa_jdk17_x86_64 4 0 0
org.apache.cassandra.cql3.functions.masking.UnmaskPermissionTest-system_keyspace_directory_jdk11_x86_64 4 0 0
org.apache.cassandra.cql3.functions.masking.UnmaskPermissionTest-system_keyspace_directory_jdk17_x86_64 4 0 0
org.apache.cassandra.cql3.restrictions.ClusteringColumnRestrictionsTest-_jdk11_x86_64 23 0 0
org.apache.cassandra.cql3.restrictions.ClusteringColumnRestrictionsTest-_jdk17_x86_64 23 0 0
org.apache.cassandra.cql3.restrictions.ClusteringColumnRestrictionsTest-cdc_jdk11_x86_64 23 0 0
org.apache.cassandra.cql3.restrictions.ClusteringColumnRestrictionsTest-cdc_jdk17_x86_64 23 0 0
org.apache.cassandra.cql3.restrictions.ClusteringColumnRestrictionsTest-compression_jdk11_x86_64 23 0 0
org.apache.cassandra.cql3.restrictions.ClusteringColumnRestrictionsTest-compression_jdk17_x86_64 23 0 0
org.apache.cassandra.cql3.restrictions.ClusteringColumnRestrictionsTest-latest_jdk11_x86_64 23 0 0
org.apache.cassandra.cql3.restrictions.ClusteringColumnRestrictionsTest-latest_jdk17_x86_64 23 0 0
org.apache.cassandra.cql3.restrictions.ClusteringColumnRestrictionsTest-oa_jdk11_x86_64 23 0 0
org.apache.cassandra.cql3.restrictions.ClusteringColumnRestrictionsTest-oa_jdk17_x86_64 23 0 0
org.apache.cassandra.cql3.restrictions.ClusteringColumnRestrictionsTest-system_keyspace_directory_jdk11_x86_64 23 0 0
org.apache.cassandra.cql3.restrictions.ClusteringColumnRestrictionsTest-system_keyspace_directory_jdk17_x86_64 23 0 0
org.apache.cassandra.cql3.restrictions.ClusteringElementsTest-_jdk11_x86_64 22 0 0
org.apache.cassandra.cql3.restrictions.ClusteringElementsTest-_jdk17_x86_64 22 0 0
org.apache.cassandra.cql3.restrictions.ClusteringElementsTest-cdc_jdk11_x86_64 22 0 0
org.apache.cassandra.cql3.restrictions.ClusteringElementsTest-cdc_jdk17_x86_64 22 0 0
org.apache.cassandra.cql3.restrictions.ClusteringElementsTest-compression_jdk11_x86_64 22 0 0
org.apache.cassandra.cql3.restrictions.ClusteringElementsTest-compression_jdk17_x86_64 22 0 0
org.apache.cassandra.cql3.restrictions.ClusteringElementsTest-latest_jdk11_x86_64 22 0 0
org.apache.cassandra.cql3.restrictions.ClusteringElementsTest-latest_jdk17_x86_64 22 0 0
org.apache.cassandra.cql3.restrictions.ClusteringElementsTest-oa_jdk11_x86_64 22 0 0
org.apache.cassandra.cql3.restrictions.ClusteringElementsTest-oa_jdk17_x86_64 22 0 0
org.apache.cassandra.cql3.restrictions.ClusteringElementsTest-system_keyspace_directory_jdk11_x86_64 22 0 0
org.apache.cassandra.cql3.restrictions.ClusteringElementsTest-system_keyspace_directory_jdk17_x86_64 22 0 0
org.apache.cassandra.cql3.selection.SelectionColumnMappingTest-_jdk11_x86_64 2 0 0
org.apache.cassandra.cql3.selection.SelectionColumnMappingTest-_jdk17_x86_64 2 0 0
org.apache.cassandra.cql3.selection.SelectionColumnMappingTest-cdc_jdk11_x86_64 2 0 0
org.apache.cassandra.cql3.selection.SelectionColumnMappingTest-cdc_jdk17_x86_64 2 0 0
org.apache.cassandra.cql3.selection.SelectionColumnMappingTest-compression_jdk11_x86_64 2 0 0
org.apache.cassandra.cql3.selection.SelectionColumnMappingTest-compression_jdk17_x86_64 2 0 0
org.apache.cassandra.cql3.selection.SelectionColumnMappingTest-latest_jdk11_x86_64 2 0 0
org.apache.cassandra.cql3.selection.SelectionColumnMappingTest-latest_jdk17_x86_64 2 0 0
org.apache.cassandra.cql3.selection.SelectionColumnMappingTest-oa_jdk11_x86_64 2 0 0
org.apache.cassandra.cql3.selection.SelectionColumnMappingTest-oa_jdk17_x86_64 2 0 0
org.apache.cassandra.cql3.selection.SelectionColumnMappingTest-system_keyspace_directory_jdk11_x86_64 2 0 0
org.apache.cassandra.cql3.selection.SelectionColumnMappingTest-system_keyspace_directory_jdk17_x86_64 2 0 0
org.apache.cassandra.cql3.selection.SelectorSerializationTest-_jdk11_x86_64 1 0 0
org.apache.cassandra.cql3.selection.SelectorSerializationTest-_jdk17_x86_64 1 0 0
org.apache.cassandra.cql3.selection.SelectorSerializationTest-cdc_jdk11_x86_64 1 0 0
org.apache.cassandra.cql3.selection.SelectorSerializationTest-cdc_jdk17_x86_64 1 0 0
org.apache.cassandra.cql3.selection.SelectorSerializationTest-compression_jdk11_x86_64 1 0 0
org.apache.cassandra.cql3.selection.SelectorSerializationTest-compression_jdk17_x86_64 1 0 0
org.apache.cassandra.cql3.selection.SelectorSerializationTest-latest_jdk11_x86_64 1 0 0
org.apache.cassandra.cql3.selection.SelectorSerializationTest-latest_jdk17_x86_64 1 0 0
org.apache.cassandra.cql3.selection.SelectorSerializationTest-oa_jdk11_x86_64 1 0 0
org.apache.cassandra.cql3.selection.SelectorSerializationTest-oa_jdk17_x86_64 1 0 0
org.apache.cassandra.cql3.selection.SelectorSerializationTest-system_keyspace_directory_jdk11_x86_64 1 0 0
org.apache.cassandra.cql3.selection.SelectorSerializationTest-system_keyspace_directory_jdk17_x86_64 1 0 0
org.apache.cassandra.cql3.selection.TermSelectionTest-_jdk11_x86_64 8 0 0
org.apache.cassandra.cql3.selection.TermSelectionTest-_jdk17_x86_64 8 0 0
org.apache.cassandra.cql3.selection.TermSelectionTest-cdc_jdk11_x86_64 8 0 0
org.apache.cassandra.cql3.selection.TermSelectionTest-cdc_jdk17_x86_64 8 0 0
org.apache.cassandra.cql3.selection.TermSelectionTest-compression_jdk11_x86_64 8 0 0
org.apache.cassandra.cql3.selection.TermSelectionTest-compression_jdk17_x86_64 8 0 0
org.apache.cassandra.cql3.selection.TermSelectionTest-latest_jdk11_x86_64 8 0 0
org.apache.cassandra.cql3.selection.TermSelectionTest-latest_jdk17_x86_64 8 0 0
org.apache.cassandra.cql3.selection.TermSelectionTest-oa_jdk11_x86_64 8 0 0
org.apache.cassandra.cql3.selection.TermSelectionTest-oa_jdk17_x86_64 8 0 0
org.apache.cassandra.cql3.selection.TermSelectionTest-system_keyspace_directory_jdk11_x86_64 8 0 0
org.apache.cassandra.cql3.selection.TermSelectionTest-system_keyspace_directory_jdk17_x86_64 8 0 0
org.apache.cassandra.cql3.statements.AddIdentityStatementTest-_jdk11_x86_64 9 0 0
org.apache.cassandra.cql3.statements.AddIdentityStatementTest-_jdk17_x86_64 9 0 0
org.apache.cassandra.cql3.statements.AddIdentityStatementTest-cdc_jdk11_x86_64 9 0 0
org.apache.cassandra.cql3.statements.AddIdentityStatementTest-cdc_jdk17_x86_64 9 0 0
org.apache.cassandra.cql3.statements.AddIdentityStatementTest-compression_jdk11_x86_64 9 0 0
org.apache.cassandra.cql3.statements.AddIdentityStatementTest-compression_jdk17_x86_64 9 0 0
org.apache.cassandra.cql3.statements.AddIdentityStatementTest-latest_jdk11_x86_64 9 0 0
org.apache.cassandra.cql3.statements.AddIdentityStatementTest-latest_jdk17_x86_64 9 0 0
org.apache.cassandra.cql3.statements.AddIdentityStatementTest-oa_jdk11_x86_64 9 0 0
org.apache.cassandra.cql3.statements.AddIdentityStatementTest-oa_jdk17_x86_64 9 0 0
org.apache.cassandra.cql3.statements.AddIdentityStatementTest-system_keyspace_directory_jdk11_x86_64 9 0 0
org.apache.cassandra.cql3.statements.AddIdentityStatementTest-system_keyspace_directory_jdk17_x86_64 9 0 0
org.apache.cassandra.cql3.statements.AlterRoleStatementTest-_jdk11_x86_64 8 0 0
org.apache.cassandra.cql3.statements.AlterRoleStatementTest-_jdk17_x86_64 8 0 0
org.apache.cassandra.cql3.statements.AlterRoleStatementTest-cdc_jdk11_x86_64 8 0 0
org.apache.cassandra.cql3.statements.AlterRoleStatementTest-cdc_jdk17_x86_64 8 0 0
org.apache.cassandra.cql3.statements.AlterRoleStatementTest-compression_jdk11_x86_64 8 0 0
org.apache.cassandra.cql3.statements.AlterRoleStatementTest-compression_jdk17_x86_64 8 0 0
org.apache.cassandra.cql3.statements.AlterRoleStatementTest-latest_jdk11_x86_64 8 0 0
org.apache.cassandra.cql3.statements.AlterRoleStatementTest-latest_jdk17_x86_64 8 0 0
org.apache.cassandra.cql3.statements.AlterRoleStatementTest-oa_jdk11_x86_64 8 0 0
org.apache.cassandra.cql3.statements.AlterRoleStatementTest-oa_jdk17_x86_64 8 0 0
org.apache.cassandra.cql3.statements.AlterRoleStatementTest-system_keyspace_directory_jdk11_x86_64 8 0 0
org.apache.cassandra.cql3.statements.AlterRoleStatementTest-system_keyspace_directory_jdk17_x86_64 8 0 0
org.apache.cassandra.cql3.statements.CreateRoleStatementTest-_jdk11_x86_64 8 0 0
org.apache.cassandra.cql3.statements.CreateRoleStatementTest-_jdk17_x86_64 8 0 0
org.apache.cassandra.cql3.statements.CreateRoleStatementTest-cdc_jdk11_x86_64 8 0 0
org.apache.cassandra.cql3.statements.CreateRoleStatementTest-cdc_jdk17_x86_64 8 0 0
org.apache.cassandra.cql3.statements.CreateRoleStatementTest-compression_jdk11_x86_64 8 0 0
org.apache.cassandra.cql3.statements.CreateRoleStatementTest-compression_jdk17_x86_64 8 0 0
org.apache.cassandra.cql3.statements.CreateRoleStatementTest-latest_jdk11_x86_64 8 0 0
org.apache.cassandra.cql3.statements.CreateRoleStatementTest-latest_jdk17_x86_64 8 0 0
org.apache.cassandra.cql3.statements.CreateRoleStatementTest-oa_jdk11_x86_64 8 0 0
org.apache.cassandra.cql3.statements.CreateRoleStatementTest-oa_jdk17_x86_64 8 0 0
org.apache.cassandra.cql3.statements.CreateRoleStatementTest-system_keyspace_directory_jdk11_x86_64 8 0 0
org.apache.cassandra.cql3.statements.CreateRoleStatementTest-system_keyspace_directory_jdk17_x86_64 8 0 0
org.apache.cassandra.cql3.statements.CreateUserStatementTest-_jdk11_x86_64 2 0 0
org.apache.cassandra.cql3.statements.CreateUserStatementTest-_jdk17_x86_64 2 0 0
org.apache.cassandra.cql3.statements.CreateUserStatementTest-cdc_jdk11_x86_64 2 0 0
org.apache.cassandra.cql3.statements.CreateUserStatementTest-cdc_jdk17_x86_64 2 0 0
org.apache.cassandra.cql3.statements.CreateUserStatementTest-compression_jdk11_x86_64 2 0 0
org.apache.cassandra.cql3.statements.CreateUserStatementTest-compression_jdk17_x86_64 2 0 0
org.apache.cassandra.cql3.statements.CreateUserStatementTest-latest_jdk11_x86_64 2 0 0
org.apache.cassandra.cql3.statements.CreateUserStatementTest-latest_jdk17_x86_64 2 0 0
org.apache.cassandra.cql3.statements.CreateUserStatementTest-oa_jdk11_x86_64 2 0 0
org.apache.cassandra.cql3.statements.CreateUserStatementTest-oa_jdk17_x86_64 2 0 0
org.apache.cassandra.cql3.statements.CreateUserStatementTest-system_keyspace_directory_jdk11_x86_64 2 0 0
org.apache.cassandra.cql3.statements.CreateUserStatementTest-system_keyspace_directory_jdk17_x86_64 2 0 0
org.apache.cassandra.cql3.statements.DescribeStatementTest-_jdk11_x86_64 19 0 0
org.apache.cassandra.cql3.statements.DescribeStatementTest-_jdk17_x86_64 19 0 0
org.apache.cassandra.cql3.statements.DescribeStatementTest-cdc_jdk11_x86_64 19 0 0
org.apache.cassandra.cql3.statements.DescribeStatementTest-cdc_jdk17_x86_64 19 0 0
org.apache.cassandra.cql3.statements.DescribeStatementTest-compression_jdk11_x86_64 19 0 0
org.apache.cassandra.cql3.statements.DescribeStatementTest-compression_jdk17_x86_64 19 0 0
org.apache.cassandra.cql3.statements.DescribeStatementTest-latest_jdk11_x86_64 19 0 0
org.apache.cassandra.cql3.statements.DescribeStatementTest-latest_jdk17_x86_64 19 0 0
org.apache.cassandra.cql3.statements.DescribeStatementTest-oa_jdk11_x86_64 19 0 0
org.apache.cassandra.cql3.statements.DescribeStatementTest-oa_jdk17_x86_64 19 0 0
org.apache.cassandra.cql3.statements.DescribeStatementTest-system_keyspace_directory_jdk11_x86_64 19 0 0
org.apache.cassandra.cql3.statements.DescribeStatementTest-system_keyspace_directory_jdk17_x86_64 19 0 0
org.apache.cassandra.cql3.statements.DropIdentityStatementTest-_jdk11_x86_64 6 0 0
org.apache.cassandra.cql3.statements.DropIdentityStatementTest-_jdk17_x86_64 6 0 0
org.apache.cassandra.cql3.statements.DropIdentityStatementTest-cdc_jdk11_x86_64 6 0 0
org.apache.cassandra.cql3.statements.DropIdentityStatementTest-cdc_jdk17_x86_64 6 0 0
org.apache.cassandra.cql3.statements.DropIdentityStatementTest-compression_jdk11_x86_64 6 0 0
org.apache.cassandra.cql3.statements.DropIdentityStatementTest-compression_jdk17_x86_64 6 0 0
org.apache.cassandra.cql3.statements.DropIdentityStatementTest-latest_jdk11_x86_64 6 0 0
org.apache.cassandra.cql3.statements.DropIdentityStatementTest-latest_jdk17_x86_64 6 0 0
org.apache.cassandra.cql3.statements.DropIdentityStatementTest-oa_jdk11_x86_64 6 0 0
org.apache.cassandra.cql3.statements.DropIdentityStatementTest-oa_jdk17_x86_64 6 0 0
org.apache.cassandra.cql3.statements.DropIdentityStatementTest-system_keyspace_directory_jdk11_x86_64 6 0 0
org.apache.cassandra.cql3.statements.DropIdentityStatementTest-system_keyspace_directory_jdk17_x86_64 6 0 0
org.apache.cassandra.cql3.statements.ListSuperUsersStatementTest-_jdk11_x86_64 5 0 0
org.apache.cassandra.cql3.statements.ListSuperUsersStatementTest-_jdk17_x86_64 5 0 0
org.apache.cassandra.cql3.statements.ListSuperUsersStatementTest-cdc_jdk11_x86_64 5 0 0
org.apache.cassandra.cql3.statements.ListSuperUsersStatementTest-cdc_jdk17_x86_64 5 0 0
org.apache.cassandra.cql3.statements.ListSuperUsersStatementTest-compression_jdk11_x86_64 5 0 0
org.apache.cassandra.cql3.statements.ListSuperUsersStatementTest-compression_jdk17_x86_64 5 0 0
org.apache.cassandra.cql3.statements.ListSuperUsersStatementTest-latest_jdk11_x86_64 5 0 0
org.apache.cassandra.cql3.statements.ListSuperUsersStatementTest-latest_jdk17_x86_64 5 0 0
org.apache.cassandra.cql3.statements.ListSuperUsersStatementTest-oa_jdk11_x86_64 5 0 0
org.apache.cassandra.cql3.statements.ListSuperUsersStatementTest-oa_jdk17_x86_64 5 0 0
org.apache.cassandra.cql3.statements.ListSuperUsersStatementTest-system_keyspace_directory_jdk11_x86_64 5 0 0
org.apache.cassandra.cql3.statements.ListSuperUsersStatementTest-system_keyspace_directory_jdk17_x86_64 5 0 0
org.apache.cassandra.cql3.statements.PropertyDefinitionsTest-_jdk11_x86_64 4 0 0
org.apache.cassandra.cql3.statements.PropertyDefinitionsTest-_jdk17_x86_64 4 0 0
org.apache.cassandra.cql3.statements.PropertyDefinitionsTest-cdc_jdk11_x86_64 4 0 0
org.apache.cassandra.cql3.statements.PropertyDefinitionsTest-cdc_jdk17_x86_64 4 0 0
org.apache.cassandra.cql3.statements.PropertyDefinitionsTest-compression_jdk11_x86_64 4 0 0
org.apache.cassandra.cql3.statements.PropertyDefinitionsTest-compression_jdk17_x86_64 4 0 0
org.apache.cassandra.cql3.statements.PropertyDefinitionsTest-latest_jdk11_x86_64 4 0 0
org.apache.cassandra.cql3.statements.PropertyDefinitionsTest-latest_jdk17_x86_64 4 0 0
org.apache.cassandra.cql3.statements.PropertyDefinitionsTest-oa_jdk11_x86_64 4 0 0
org.apache.cassandra.cql3.statements.PropertyDefinitionsTest-oa_jdk17_x86_64 4 0 0
org.apache.cassandra.cql3.statements.PropertyDefinitionsTest-system_keyspace_directory_jdk11_x86_64 4 0 0
org.apache.cassandra.cql3.statements.PropertyDefinitionsTest-system_keyspace_directory_jdk17_x86_64 4 0 0
org.apache.cassandra.cql3.statements.SelectStatementTest-_jdk11_x86_64 1 0 0
org.apache.cassandra.cql3.statements.SelectStatementTest-_jdk17_x86_64 1 0 0
org.apache.cassandra.cql3.statements.SelectStatementTest-cdc_jdk11_x86_64 1 0 0
org.apache.cassandra.cql3.statements.SelectStatementTest-cdc_jdk17_x86_64 1 0 0
org.apache.cassandra.cql3.statements.SelectStatementTest-compression_jdk11_x86_64 1 0 0
org.apache.cassandra.cql3.statements.SelectStatementTest-compression_jdk17_x86_64 1 0 0
org.apache.cassandra.cql3.statements.SelectStatementTest-latest_jdk11_x86_64 1 0 0
org.apache.cassandra.cql3.statements.SelectStatementTest-latest_jdk17_x86_64 1 0 0
org.apache.cassandra.cql3.statements.SelectStatementTest-oa_jdk11_x86_64 1 0 0
org.apache.cassandra.cql3.statements.SelectStatementTest-oa_jdk17_x86_64 1 0 0
org.apache.cassandra.cql3.statements.SelectStatementTest-system_keyspace_directory_jdk11_x86_64 1 0 0
org.apache.cassandra.cql3.statements.SelectStatementTest-system_keyspace_directory_jdk17_x86_64 1 0 0
org.apache.cassandra.cql3.terms.ListsTest-_jdk11_x86_64 6 0 0
org.apache.cassandra.cql3.terms.ListsTest-_jdk17_x86_64 6 0 0
org.apache.cassandra.cql3.terms.ListsTest-cdc_jdk11_x86_64 6 0 0
org.apache.cassandra.cql3.terms.ListsTest-cdc_jdk17_x86_64 6 0 0
org.apache.cassandra.cql3.terms.ListsTest-compression_jdk11_x86_64 6 0 0
org.apache.cassandra.cql3.terms.ListsTest-compression_jdk17_x86_64 6 0 0
org.apache.cassandra.cql3.terms.ListsTest-latest_jdk11_x86_64 6 0 0
org.apache.cassandra.cql3.terms.ListsTest-latest_jdk17_x86_64 6 0 0
org.apache.cassandra.cql3.terms.ListsTest-oa_jdk11_x86_64 6 0 0
org.apache.cassandra.cql3.terms.ListsTest-oa_jdk17_x86_64 6 0 0
org.apache.cassandra.cql3.terms.ListsTest-system_keyspace_directory_jdk11_x86_64 6 0 0
org.apache.cassandra.cql3.terms.ListsTest-system_keyspace_directory_jdk17_x86_64 6 0 0
org.apache.cassandra.cql3.validation.entities.CollectionsTest-_jdk11_x86_64 57 0 0
org.apache.cassandra.cql3.validation.entities.CollectionsTest-_jdk17_x86_64 57 0 0
org.apache.cassandra.cql3.validation.entities.CollectionsTest-cdc_jdk11_x86_64 57 0 0
org.apache.cassandra.cql3.validation.entities.CollectionsTest-cdc_jdk17_x86_64 57 0 0
org.apache.cassandra.cql3.validation.entities.CollectionsTest-compression_jdk11_x86_64 57 0 0
org.apache.cassandra.cql3.validation.entities.CollectionsTest-compression_jdk17_x86_64 57 0 0
org.apache.cassandra.cql3.validation.entities.CollectionsTest-latest_jdk11_x86_64 57 0 0
org.apache.cassandra.cql3.validation.entities.CollectionsTest-latest_jdk17_x86_64 57 0 0
org.apache.cassandra.cql3.validation.entities.CollectionsTest-oa_jdk11_x86_64 57 0 0
org.apache.cassandra.cql3.validation.entities.CollectionsTest-oa_jdk17_x86_64 57 0 0
org.apache.cassandra.cql3.validation.entities.CollectionsTest-system_keyspace_directory_jdk11_x86_64 57 0 0
org.apache.cassandra.cql3.validation.entities.CollectionsTest-system_keyspace_directory_jdk17_x86_64 57 0 0
org.apache.cassandra.cql3.validation.entities.CountersTest-_jdk11_x86_64 8 0 0
org.apache.cassandra.cql3.validation.entities.CountersTest-_jdk17_x86_64 8 0 0
org.apache.cassandra.cql3.validation.entities.CountersTest-cdc_jdk11_x86_64 8 0 0
org.apache.cassandra.cql3.validation.entities.CountersTest-cdc_jdk17_x86_64 8 0 0
org.apache.cassandra.cql3.validation.entities.CountersTest-compression_jdk11_x86_64 8 0 0
org.apache.cassandra.cql3.validation.entities.CountersTest-compression_jdk17_x86_64 8 0 0
org.apache.cassandra.cql3.validation.entities.CountersTest-latest_jdk11_x86_64 8 0 0
org.apache.cassandra.cql3.validation.entities.CountersTest-latest_jdk17_x86_64 8 0 0
org.apache.cassandra.cql3.validation.entities.CountersTest-oa_jdk11_x86_64 8 0 0
org.apache.cassandra.cql3.validation.entities.CountersTest-oa_jdk17_x86_64 8 0 0
org.apache.cassandra.cql3.validation.entities.CountersTest-system_keyspace_directory_jdk11_x86_64 8 0 0
org.apache.cassandra.cql3.validation.entities.CountersTest-system_keyspace_directory_jdk17_x86_64 8 0 0
org.apache.cassandra.cql3.validation.entities.DateTypeTest-_jdk11_x86_64 1 0 0
org.apache.cassandra.cql3.validation.entities.DateTypeTest-_jdk17_x86_64 1 0 0
org.apache.cassandra.cql3.validation.entities.DateTypeTest-cdc_jdk11_x86_64 1 0 0
org.apache.cassandra.cql3.validation.entities.DateTypeTest-cdc_jdk17_x86_64 1 0 0
org.apache.cassandra.cql3.validation.entities.DateTypeTest-compression_jdk11_x86_64 1 0 0
org.apache.cassandra.cql3.validation.entities.DateTypeTest-compression_jdk17_x86_64 1 0 0
org.apache.cassandra.cql3.validation.entities.DateTypeTest-latest_jdk11_x86_64 1 0 0
org.apache.cassandra.cql3.validation.entities.DateTypeTest-latest_jdk17_x86_64 1 0 0
org.apache.cassandra.cql3.validation.entities.DateTypeTest-oa_jdk11_x86_64 1 0 0
org.apache.cassandra.cql3.validation.entities.DateTypeTest-oa_jdk17_x86_64 1 0 0
org.apache.cassandra.cql3.validation.entities.DateTypeTest-system_keyspace_directory_jdk11_x86_64 1 0 0
org.apache.cassandra.cql3.validation.entities.DateTypeTest-system_keyspace_directory_jdk17_x86_64 1 0 0
org.apache.cassandra.cql3.validation.entities.FrozenCollectionsTest-_jdk11_x86_64 34 0 0
org.apache.cassandra.cql3.validation.entities.FrozenCollectionsTest-_jdk17_x86_64 34 0 0
org.apache.cassandra.cql3.validation.entities.FrozenCollectionsTest-cdc_jdk11_x86_64 34 0 0
org.apache.cassandra.cql3.validation.entities.FrozenCollectionsTest-cdc_jdk17_x86_64 34 0 0
org.apache.cassandra.cql3.validation.entities.FrozenCollectionsTest-compression_jdk11_x86_64 34 0 0
org.apache.cassandra.cql3.validation.entities.FrozenCollectionsTest-compression_jdk17_x86_64 34 0 0
org.apache.cassandra.cql3.validation.entities.FrozenCollectionsTest-latest_jdk11_x86_64 32 0 2
org.apache.cassandra.cql3.validation.entities.FrozenCollectionsTest-latest_jdk17_x86_64 32 0 2
org.apache.cassandra.cql3.validation.entities.FrozenCollectionsTest-oa_jdk11_x86_64 34 0 0
org.apache.cassandra.cql3.validation.entities.FrozenCollectionsTest-oa_jdk17_x86_64 34 0 0
org.apache.cassandra.cql3.validation.entities.FrozenCollectionsTest-system_keyspace_directory_jdk11_x86_64 34 0 0
org.apache.cassandra.cql3.validation.entities.FrozenCollectionsTest-system_keyspace_directory_jdk17_x86_64 34 0 0
org.apache.cassandra.cql3.validation.entities.JsonTest-_jdk11_x86_64 23 0 0
org.apache.cassandra.cql3.validation.entities.JsonTest-_jdk17_x86_64 23 0 0
org.apache.cassandra.cql3.validation.entities.JsonTest-cdc_jdk11_x86_64 23 0 0
org.apache.cassandra.cql3.validation.entities.JsonTest-cdc_jdk17_x86_64 23 0 0
org.apache.cassandra.cql3.validation.entities.JsonTest-compression_jdk11_x86_64 23 0 0
org.apache.cassandra.cql3.validation.entities.JsonTest-compression_jdk17_x86_64 23 0 0
org.apache.cassandra.cql3.validation.entities.JsonTest-latest_jdk11_x86_64 23 0 0
org.apache.cassandra.cql3.validation.entities.JsonTest-latest_jdk17_x86_64 23 0 0
org.apache.cassandra.cql3.validation.entities.JsonTest-oa_jdk11_x86_64 23 0 0
org.apache.cassandra.cql3.validation.entities.JsonTest-oa_jdk17_x86_64 23 0 0
org.apache.cassandra.cql3.validation.entities.JsonTest-system_keyspace_directory_jdk11_x86_64 23 0 0
org.apache.cassandra.cql3.validation.entities.JsonTest-system_keyspace_directory_jdk17_x86_64 23 0 0
org.apache.cassandra.cql3.validation.entities.SecondaryIndexOnMapEntriesTest-_jdk11_x86_64 11 0 0
org.apache.cassandra.cql3.validation.entities.SecondaryIndexOnMapEntriesTest-_jdk17_x86_64 11 0 0
org.apache.cassandra.cql3.validation.entities.SecondaryIndexOnMapEntriesTest-cdc_jdk11_x86_64 11 0 0
org.apache.cassandra.cql3.validation.entities.SecondaryIndexOnMapEntriesTest-cdc_jdk17_x86_64 11 0 0
org.apache.cassandra.cql3.validation.entities.SecondaryIndexOnMapEntriesTest-compression_jdk11_x86_64 11 0 0
org.apache.cassandra.cql3.validation.entities.SecondaryIndexOnMapEntriesTest-compression_jdk17_x86_64 11 0 0
org.apache.cassandra.cql3.validation.entities.SecondaryIndexOnMapEntriesTest-latest_jdk11_x86_64 0 0 1
org.apache.cassandra.cql3.validation.entities.SecondaryIndexOnMapEntriesTest-latest_jdk17_x86_64 0 0 1
org.apache.cassandra.cql3.validation.entities.SecondaryIndexOnMapEntriesTest-oa_jdk11_x86_64 11 0 0
org.apache.cassandra.cql3.validation.entities.SecondaryIndexOnMapEntriesTest-oa_jdk17_x86_64 11 0 0
org.apache.cassandra.cql3.validation.entities.SecondaryIndexOnMapEntriesTest-system_keyspace_directory_jdk11_x86_64 11 0 0
org.apache.cassandra.cql3.validation.entities.SecondaryIndexOnMapEntriesTest-system_keyspace_directory_jdk17_x86_64 11 0 0
org.apache.cassandra.cql3.validation.entities.SecondaryIndexOnStaticColumnTest-_jdk11_x86_64 6 0 0
org.apache.cassandra.cql3.validation.entities.SecondaryIndexOnStaticColumnTest-_jdk17_x86_64 6 0 0
org.apache.cassandra.cql3.validation.entities.SecondaryIndexOnStaticColumnTest-cdc_jdk11_x86_64 6 0 0
org.apache.cassandra.cql3.validation.entities.SecondaryIndexOnStaticColumnTest-cdc_jdk17_x86_64 6 0 0
org.apache.cassandra.cql3.validation.entities.SecondaryIndexOnStaticColumnTest-compression_jdk11_x86_64 6 0 0
org.apache.cassandra.cql3.validation.entities.SecondaryIndexOnStaticColumnTest-compression_jdk17_x86_64 6 0 0
org.apache.cassandra.cql3.validation.entities.SecondaryIndexOnStaticColumnTest-latest_jdk11_x86_64 6 0 0
org.apache.cassandra.cql3.validation.entities.SecondaryIndexOnStaticColumnTest-latest_jdk17_x86_64 6 0 0
org.apache.cassandra.cql3.validation.entities.SecondaryIndexOnStaticColumnTest-oa_jdk11_x86_64 6 0 0
org.apache.cassandra.cql3.validation.entities.SecondaryIndexOnStaticColumnTest-oa_jdk17_x86_64 6 0 0
org.apache.cassandra.cql3.validation.entities.SecondaryIndexOnStaticColumnTest-system_keyspace_directory_jdk11_x86_64 6 0 0
org.apache.cassandra.cql3.validation.entities.SecondaryIndexOnStaticColumnTest-system_keyspace_directory_jdk17_x86_64 6 0 0
org.apache.cassandra.cql3.validation.entities.SecondaryIndexTest-_jdk11_x86_64 60 0 0
org.apache.cassandra.cql3.validation.entities.SecondaryIndexTest-_jdk17_x86_64 60 0 0
org.apache.cassandra.cql3.validation.entities.SecondaryIndexTest-cdc_jdk11_x86_64 60 0 0
org.apache.cassandra.cql3.validation.entities.SecondaryIndexTest-cdc_jdk17_x86_64 60 0 0
org.apache.cassandra.cql3.validation.entities.SecondaryIndexTest-compression_jdk11_x86_64 60 0 0
org.apache.cassandra.cql3.validation.entities.SecondaryIndexTest-compression_jdk17_x86_64 60 0 0
org.apache.cassandra.cql3.validation.entities.SecondaryIndexTest-latest_jdk11_x86_64 60 0 0
org.apache.cassandra.cql3.validation.entities.SecondaryIndexTest-latest_jdk17_x86_64 60 0 0
org.apache.cassandra.cql3.validation.entities.SecondaryIndexTest-oa_jdk11_x86_64 60 0 0
org.apache.cassandra.cql3.validation.entities.SecondaryIndexTest-oa_jdk17_x86_64 60 0 0
org.apache.cassandra.cql3.validation.entities.SecondaryIndexTest-system_keyspace_directory_jdk11_x86_64 60 0 0
org.apache.cassandra.cql3.validation.entities.SecondaryIndexTest-system_keyspace_directory_jdk17_x86_64 60 0 0
org.apache.cassandra.cql3.validation.entities.StaticColumnsTest-_jdk11_x86_64 7 0 0
org.apache.cassandra.cql3.validation.entities.StaticColumnsTest-_jdk17_x86_64 7 0 0
org.apache.cassandra.cql3.validation.entities.StaticColumnsTest-cdc_jdk11_x86_64